{"text_format":"1","workbook":"xlsx","n_sheets":44,"sheets":["Quick guide","Start","Audit questions","Year","Process Updates","Graphs","April","Apr-Raw","Apr-Data","May","May-Raw","May-Data","June","June-Raw","June-Data","July","July-Raw","July-Data","Aug","Aug-Raw","Aug-Data","Sept","Sept-Raw","Sept-Data","Oct","Oct-Raw","Oct-Data","Nov","Nov-Raw","Nov-Data","Dec","Dec-Raw","Dec-Data","Jan","Jan-Raw","Jan-Data","Feb","feb-Raw","feb-Data","March","march-Raw","march-Data","Export","Math"],"not_rendered":{"charts":3,"images":8,"macros":1,"external_links":0,"defined_names":5,"comments":0,"pivot_tables":0},"unopened":[],"bounds":{"document_bytes":16777216,"sheet_cells":100000,"rows_first":2000,"rows_last":500,"rows_between":2000,"halvings":0,"cell_chars":16384,"cell_head_chars":4096},"cells_cut":0,"cells_raw":0,"read":"whole","date_system":"1900"}

{"sheet":"Quick guide","index":0,"n_rows":243,"n_cols":2,"rows_kept":243,"cut":false,"hidden":false,"merged":[]}
[]
["About"]
["Hi! This guide is designed to help you get the most of this Quality monitoring tool. it will cover the basis of how to use it along with a few other tips"]
["This tool was designed to help remove all the irritating mathematics involved in audits and make things easier for all involved."]
["The following menu is hyperlinked to the relevant section, click on what you need to know."]
[]
["1. Using the sheet for the first time"]
["2. General information"]
["3. Setting the audit title"]
["4. Setting up the questions"]
["5. Setting the audit month"]
["6. Completing an audit"]
["7. View results - by month"]
["8. View the raw data"]
["9. view results - for the year"]
["10. Graph stuff"]
["11. Create a report/export"]
["12. Process updates"]
["13. Tips"]
["14. Other information"]
[]
["1. Using the sheet for the first time"]
["Please ensure you make a fresh copy of it in the relevant Audit folder - please do not use the original!"]
["The first time you activate this sheet, please ensure you have activated Macros and made it a trusted document if asked."]
[]
[]
[]
[]
[]
[]
["2. General information"]
["The Quality monitoring tool (QM tool from now) has quite a few tabs."]
[null,"Tabs with this colour contain consolidated information for all the audits"]
[null,"These tabs have result breakdowns for the labelled month"]
[null,"this is involved with creating reports, just ignore it"]
[null,"These tabs (this included) have information & settings type stuff"]
[null,"These tabs go into greater detail for results, they're hidden to start with."]
[null,"If you've found these please leave them alone, they get cranky if disturbed."]
[]
["3. Setting the audit title"]
["Your audit will need a title, this is done by entering it into the blue box on the 'Start' tab next to 'Quality Monitoring Audit Title'"]
[]
["4. Setting up the questions"]
["The most important part of the audit is setting your questions. To reveal the tab to enter them click 'Set/Show audit questions' on the start tab."]
["This will reveal a new tab called 'Audit questions'"]
["Enter your questions in the blue highlighted cells, these are in column A rows 2-41. "]
["Please note that if you enter anything past this limit it will not show up in the audit data entry."]
["Any changes to your questions will automatically cascade through the rest of the audit tool."]
[]
["5. Setting the audit month"]
["With your audit questions now entered you will need to set the month you are auditing."]
["This is done by selecting it from the drop down on the start tab next to 'Current data collection month'"]
["Please remember to change this each time you audit a new month. "]
[]
["6. Completing an audit"]
["The audit data collection screen can be access on the 'Start' tab by clicking 'Audit Data collection'"]
["The data will be collected for the currently select audit month. "]
["The data collection screen looks like this (but with your questions):"]
[]
[]
[]
[]
[]
[]
[]
[]
[]
[]
[]
[]
[]
[]
[]
[]
[]
[]
[]
[]
[]
[]
[]
[]
[]
[]
[]
[]
[]
[]
[]
["You can navigate through the questions by either clicking on the 'next page' button (and previous page button on subsequent pages) Or by clicking on the page number tabs."]
["You can exit by clicking cancel/exit towards the bottom."]
[]
["The first thing you need to do is record the patients ID number. If you are doing an audit which doesn’t involve patients you will need an identifier for which 'record' this is"]
["You cannot submit information without there being some kind of identifier in this box"]
["For Audits involving patients information/files you can then proceed to fill in the other boxes. You should know if you need to collect this data before starting your Audit."]
["After this you get to the questions proper."]
["The QM Tool is mainly designed to record 'compliance' questions. This is where something was or wasn't done, or in some cases was not applicable."]
["There is also the option to say 'No - Justified', this is where something hasn’t complied but there was a good reason for it."]
["The compliance options can be found next to each question in the 'compliance' column"]
[]
[]
[]
[]
[]
[]
[]
[]
[]
["Other questions may need you to record a non-compliance result. For this kind of question the result goes in the 'other result' box."]
["in these instances you can leave the compliance box empty (unless its asking for more detail on the result!)"]
[]
[]
[]
[]
[]
[]
[]
[]
["its worth noting that results that go into 'other result' have absolutely no influence on the results produced by the QM Tool"]
[]
["Each page of this menu has up to 10 questions, so please make sure you have checked they're all answered before submitting the data. Pages without questions will hide automatically"]
["on the last page you will find a box for any additional notes you may have for this record."]
[]
[]
[]
[]
[]
[]
[]
[]
[]
[]
[]
[]
[]
[]
[]
[]
[]
["once everything is done, click 'submit results' at the bottom. This will save your information"]
["If you have missed any questions they will be highlighted before you can finish the submission."]
[]
[]
[]
[]
[]
[]
[]
[]
[]
[]
["the menu will now re-appear ready for your next entry. "]
["once you have completed all your entries for the month click 'cancel/Exit'"]
["if you haven't finished all your data entries for the month, don’t worry, you can come back to it."]
["you can keep adding to it until you change the audit collection month."]
[]
["7. view results - by month"]
["Now you have completed your Audit for the month you can go look at the results."]
["click on the relevant month tab & you will see something like this:"]
[]
[]
[]
[]
[]
[]
[]
[]
[]
[]
[]
[]
[]
[]
["*Please note that 'target %' is no longer featured*"]
["The sheet gives a breakdown of each compliance answer against the question. "]
["Results will highlight based on the 'traffic lights' from the 'year' tab (if set)"]
["You can also enter the date the audit was completed & who by - which is useful if several people are responsible for the audit."]
["The sample group size fills in automatically."]
[]
["if you have been recording the type of appointment (New of follow-up) you will also get the information of how many pts had that description"]
["If you have been recording the appointment code and type it in you can see how many of your sample group attended that clinic."]
[]
["8. View the raw data"]
["If you have recorded non-compliance results, or need to tweak a submission after it has been completed, you will need to access the raw audit data."]
["To show the raw audit data click 'View raw audit data' on the start tab"]
["New tabs containing the raw data for each month will now be revealed."]
[]
[]
["click on the tab you need & you will see something similar to this:"]
[]
[]
[]
[]
[]
[]
[]
[]
[]
[]
[]
[]
[]
[]
["There are drop downs in each compliance column should you need to change a result (this prevents the math being broken)"]
["the raw data tabs will hide again when you close the QM tool."]
[]
["9. View results - for the year"]
["for regular/monthly audits you may want to view the results for the year to help identify any trends. You can do this through the 'year' tab"]
["This provides the full results breakdown for each question across the year."]
["On this tab you can also set your 'traffic lights' which will RAG rate results throughout the sheet. "]
[]
["10. Graph stuff"]
["The 'graphs' tab takes information from the 'year' tab and puts it into a more visual medium."]
["To get the best use of these, its recommended you re-configure the graphs through their filter & de-select any blanks"]
["they're originally set to show results for 40 questions, so if you only have 10 deselecting them will make the visual cleaner."]
[]
["11. Create a report/export"]
["After completing your audit you may want to generate a report which details your results."]
["The QM tool can generate a report for you which will details current results and the previous months results (except on the April report)."]
["The report will be generated for your currently selected audit month, if you need it for a different one please amend as per section 4."]
["To create a report click 'Create audit report for selected month' on the 'Start' tab"]
[]
["The QM tool will do some stuff and generate a new sheet with your report."]
["Your report is now good to go. Though you may want to delete any rows which have blank question spaces."]
[]
["12. Process updates"]
["The process updates tab is a place to note any ket changes you may to processess as a result of your audits."]
["This will help you identify if they have had a positive effect on your results or not."]
[]
["13. Tips"]
["1. make sure your questions make sense and have yes/no answers, it’s a good idea to test them out a couple of times before committing to them for the year"]
["2. make sure your questions aren't too long. There is limited space in the data collection menu, questions that are too long just wont show up"]
["3. don't be afraid to add extra graphs to the graph tab if you need to"]
["4. the sheet is made for one financial year run of an audit, at the end you'll need a new one. "]
[]
["14. Other information"]
["If you need to alter an audits questions or add new ones, you must do this through the questions tab"]
["Please note that if you move questions around or remove some after having already previously submitted data, the data for the original questions will remain"]
["Whilst this audit tool can do a few things, its not smart enough to know when a question has moved/been removed."]
["To account for this you would need to amend the results through the 'raw' data tabs."]
["However, please do not take the easy route and delete any affected columns as this may have a knock on effect and cause the sheet to develop errors."]
["It is highly recommended that you do a few test runs of your questions first before settling on them - create a fresh copy each time until you're done."]
["After the trial you then 'lock' them for the rest of your audit cycle to preserve the integrity of your results."]

{"sheet":"Start","index":1,"n_rows":19,"n_cols":6,"rows_kept":19,"cut":false,"hidden":false,"merged":[[0,1,0,4],[1,1,1,4]]}
["Quality Monitoring Audit Title","Test audit",null,null,null,"< Enter"]
["Current data collection month","April",null,null,null,"<Select"]
[]
[]
[]
[]
[]
[]
[]
[]
[]
[]
[]
["Audit tool V 3.5 (shareable simplified (May 2025))"]
[]
[]
[]
["© 2023 Nottingham University Hospitals Trust"]
["The copyright in this documentation is owned by Nottingham University Hospitals Trust and this documentation may not (except under a written licence granted by Nottingham University Hospitals Trust, strictly in accordance with that licence) be copied, stored on any electronic medium or transmitted over any electronic network, loaded into or stored in any computer, or reproduced in any other way."]

{"sheet":"Audit questions","index":2,"n_rows":41,"n_cols":3,"rows_kept":41,"cut":false,"hidden":true,"merged":[[1,2,9,7]]}
["Questions"]
["Test1",null,"Enter your questions in the blue rows in column A. A max of 40 questions  can be listed. If you have any rows with 'Test' questions left, please delete their contents before starting your audit."]
["Test2"]
["Test3"]
["Test4"]
["Test5"]
["Test6"]
["Test7"]
["Test8"]
["Test9"]
["Test10"]
["Test11"]
["Test12"]
["Test13"]
["Test14"]
["Test15"]
["Test16"]
["Test17"]
["Test18"]
["Test19"]
["Test20"]
["Test21"]
["Test22"]
["Test23"]
["Test24"]
["Test25"]
["Test26"]
["Test27"]
["Test28"]
["Test29"]
["Test30"]
["Test31"]
["Test32"]
["Test33"]
["Test34"]
["Test35"]
["Test36"]
["Test37"]
["Test38"]
["Test39"]
["Test40"]

{"sheet":"Year","index":3,"n_rows":186,"n_cols":15,"rows_kept":186,"cut":false,"hidden":false,"merged":[[0,1,0,4],[1,1,1,4]]}
["Quality Monitoring Audit",{"$f":"IF(ISERROR(Start!B1),\"\",Start!B1)","v":"Test audit"}]
["Year"]
[]
["Total number of audits ",{"$f":"IF(ISERROR(COUNTIF(April!B5,\">0\")+COUNTIF(May!B5,\">0\")+COUNTIF(June!B5,\">0\")+COUNTIF(July!B5,\">0\")+COUNTIF(Aug!B5,\">0\")+COUNTIF(Sept!B5,\">0\")++COUNTIF(Oct!B5,\">0\")+COUNTIF(Nov!B5,\">0\")+COUNTIF(Dec!B5,\">0\")+COUNTIF(Jan!B5,\">0\")+COUNTIF(Feb!B5,\">0\")+COUNTIF(March!B5,\">0\")),\"0\",COUNTIF(April!B5,\">0\")+COUNTIF(May!B5,\">0\")+COUNTIF(June!B5,\">0\")+COUNTIF(July!B5,\">0\")+COUNTIF(Aug!B5,\">0\")+COUNTIF(Sept!B5,\">0\")++COUNTIF(Oct!B5,\">0\")+COUNTIF(Nov!B5,\">0\")+COUNTIF(Dec!B5,\">0\")+COUNTIF(Jan!B5,\">0\")+COUNTIF(Feb!B5,\">0\")+COUNTIF(March!B5,\">0\"))","v":0},null,null,null,null,"If no specific targets are set, results will default to traffic lights (if set)"]
["Average compliance for year",{"$f":"IF(ISERROR(N98),\"\",N98)","v":""},null,null,null,null,"above",0.95,"< altering these will change the rating throughout"]
["Average compliance with justified for year",{"$f":"IF(ISERROR(N54),\"\",N54)","v":""},null,null,null,null,"between","80-95%"]
["Highest compliance value",{"$f":"MAX(B98:M98)","v":0},null,null,null,null,"below",0.8,"< altering these will change the rating throughout"]
["Lowest compliance value",{"$f":"IF(ISERROR(SMALL(B98:M98,COUNTIF(B98:M98,0)+1)),\"\",SMALL(B98:M98,COUNTIF(B98:M98,0)+1))","v":""}]
["Highest compliance value with justified",{"$f":"MAX(B54:M54)","v":0}]
["Lowest compliance value with justified",{"$f":"IF(ISERROR(SMALL(B54:M54,COUNTIF(B54:M54,0)+1)),\"\",SMALL(B54:M54,COUNTIF(B54:M54,0)+1))","v":""}]
[]
["Overall result (compliant + Justified)","(click through to month)"]
["Metric","April","May","June","July","August","September","October","November","December","January","February","March","Year average","Math"]
[{"$f":"IF(ISERROR('Audit questions'!A2),\"\",'Audit questions'!A2)","v":"Test1"},{"$f":"IFERROR(INDEX(April!B:B,MATCH(Year!A:A,April!A:A,0)),\"\")","v":""},{"$f":"IFERROR(INDEX(May!B:B,MATCH(Year!A:A,May!A:A,0)),\"\")","v":""},{"$f":"IFERROR(INDEX(June!B:B,MATCH(Year!A:A,June!A:A,0)),\"\")","v":""},{"$f":"IFERROR(INDEX(July!B:B,MATCH(Year!A:A,July!A:A,0)),\"\")","v":""},{"$f":"IFERROR(INDEX(Aug!B:B,MATCH(Year!A:A,Aug!A:A,0)),\"\")","v":""},{"$f":"IFERROR(INDEX(Sept!B:B,MATCH(Year!A:A,Sept!A:A,0)),\"\")","v":""},{"$f":"IFERROR(INDEX(Oct!B:B,MATCH(Year!A:A,Oct!A:A,0)),\"\")","v":""},{"$f":"IFERROR(INDEX(Nov!B:B,MATCH(Year!A:A,Nov!A:A,0)),\"\")","v":""},{"$f":"IFERROR(INDEX(Dec!B:B,MATCH(Year!A:A,Dec!A:A,0)),\"\")","v":""},{"$f":"IFERROR(INDEX(Jan!B:B,MATCH(Year!A:A,Jan!A:A,0)),\"\")","v":""},{"$f":"IFERROR(INDEX(Feb!B:B,MATCH(Year!A:A,Feb!A:A,0)),\"\")","v":""},{"$f":"IFERROR(INDEX(March!B:B,MATCH(Year!A:A,March!A:A,0)),\"\")","v":""},{"$f":"IF(ISERROR((SUM(B14:M14))/O14),\"\",(SUM(B14:M14))/O14)","v":""},{"$f":"COUNTIF(B14:M14,\">-1\")","v":0}]
[{"$f":"IF(ISERROR('Audit questions'!A3),\"\",'Audit questions'!A3)","v":"Test2"},{"$f":"IFERROR(INDEX(April!B:B,MATCH(Year!A:A,April!A:A,0)),\"\")","v":""},{"$f":"IFERROR(INDEX(May!B:B,MATCH(Year!A:A,May!A:A,0)),\"\")","v":""},{"$f":"IFERROR(INDEX(June!B:B,MATCH(Year!A:A,June!A:A,0)),\"\")","v":""},{"$f":"IFERROR(INDEX(July!B:B,MATCH(Year!A:A,July!A:A,0)),\"\")","v":""},{"$f":"IFERROR(INDEX(Aug!B:B,MATCH(Year!A:A,Aug!A:A,0)),\"\")","v":""},{"$f":"IFERROR(INDEX(Sept!B:B,MATCH(Year!A:A,Sept!A:A,0)),\"\")","v":""},{"$f":"IFERROR(INDEX(Oct!B:B,MATCH(Year!A:A,Oct!A:A,0)),\"\")","v":""},{"$f":"IFERROR(INDEX(Nov!B:B,MATCH(Year!A:A,Nov!A:A,0)),\"\")","v":""},{"$f":"IFERROR(INDEX(Dec!B:B,MATCH(Year!A:A,Dec!A:A,0)),\"\")","v":""},{"$f":"IFERROR(INDEX(Jan!B:B,MATCH(Year!A:A,Jan!A:A,0)),\"\")","v":""},{"$f":"IFERROR(INDEX(Feb!B:B,MATCH(Year!A:A,Feb!A:A,0)),\"\")","v":""},{"$f":"IFERROR(INDEX(March!B:B,MATCH(Year!A:A,March!A:A,0)),\"\")","v":""},"",0]
[{"$f":"IF(ISERROR('Audit questions'!A4),\"\",'Audit questions'!A4)","v":"Test3"},{"$f":"IFERROR(INDEX(April!B:B,MATCH(Year!A:A,April!A:A,0)),\"\")","v":""},{"$f":"IFERROR(INDEX(May!B:B,MATCH(Year!A:A,May!A:A,0)),\"\")","v":""},{"$f":"IFERROR(INDEX(June!B:B,MATCH(Year!A:A,June!A:A,0)),\"\")","v":""},{"$f":"IFERROR(INDEX(July!B:B,MATCH(Year!A:A,July!A:A,0)),\"\")","v":""},{"$f":"IFERROR(INDEX(Aug!B:B,MATCH(Year!A:A,Aug!A:A,0)),\"\")","v":""},{"$f":"IFERROR(INDEX(Sept!B:B,MATCH(Year!A:A,Sept!A:A,0)),\"\")","v":""},{"$f":"IFERROR(INDEX(Oct!B:B,MATCH(Year!A:A,Oct!A:A,0)),\"\")","v":""},{"$f":"IFERROR(INDEX(Nov!B:B,MATCH(Year!A:A,Nov!A:A,0)),\"\")","v":""},{"$f":"IFERROR(INDEX(Dec!B:B,MATCH(Year!A:A,Dec!A:A,0)),\"\")","v":""},{"$f":"IFERROR(INDEX(Jan!B:B,MATCH(Year!A:A,Jan!A:A,0)),\"\")","v":""},{"$f":"IFERROR(INDEX(Feb!B:B,MATCH(Year!A:A,Feb!A:A,0)),\"\")","v":""},{"$f":"IFERROR(INDEX(March!B:B,MATCH(Year!A:A,March!A:A,0)),\"\")","v":""},"",0]
[{"$f":"IF(ISERROR('Audit questions'!A5),\"\",'Audit questions'!A5)","v":"Test4"},{"$f":"IFERROR(INDEX(April!B:B,MATCH(Year!A:A,April!A:A,0)),\"\")","v":""},{"$f":"IFERROR(INDEX(May!B:B,MATCH(Year!A:A,May!A:A,0)),\"\")","v":""},{"$f":"IFERROR(INDEX(June!B:B,MATCH(Year!A:A,June!A:A,0)),\"\")","v":""},{"$f":"IFERROR(INDEX(July!B:B,MATCH(Year!A:A,July!A:A,0)),\"\")","v":""},{"$f":"IFERROR(INDEX(Aug!B:B,MATCH(Year!A:A,Aug!A:A,0)),\"\")","v":""},{"$f":"IFERROR(INDEX(Sept!B:B,MATCH(Year!A:A,Sept!A:A,0)),\"\")","v":""},{"$f":"IFERROR(INDEX(Oct!B:B,MATCH(Year!A:A,Oct!A:A,0)),\"\")","v":""},{"$f":"IFERROR(INDEX(Nov!B:B,MATCH(Year!A:A,Nov!A:A,0)),\"\")","v":""},{"$f":"IFERROR(INDEX(Dec!B:B,MATCH(Year!A:A,Dec!A:A,0)),\"\")","v":""},{"$f":"IFERROR(INDEX(Jan!B:B,MATCH(Year!A:A,Jan!A:A,0)),\"\")","v":""},{"$f":"IFERROR(INDEX(Feb!B:B,MATCH(Year!A:A,Feb!A:A,0)),\"\")","v":""},{"$f":"IFERROR(INDEX(March!B:B,MATCH(Year!A:A,March!A:A,0)),\"\")","v":""},"",0]
[{"$f":"IF(ISERROR('Audit questions'!A6),\"\",'Audit questions'!A6)","v":"Test5"},{"$f":"IFERROR(INDEX(April!B:B,MATCH(Year!A:A,April!A:A,0)),\"\")","v":""},{"$f":"IFERROR(INDEX(May!B:B,MATCH(Year!A:A,May!A:A,0)),\"\")","v":""},{"$f":"IFERROR(INDEX(June!B:B,MATCH(Year!A:A,June!A:A,0)),\"\")","v":""},{"$f":"IFERROR(INDEX(July!B:B,MATCH(Year!A:A,July!A:A,0)),\"\")","v":""},{"$f":"IFERROR(INDEX(Aug!B:B,MATCH(Year!A:A,Aug!A:A,0)),\"\")","v":""},{"$f":"IFERROR(INDEX(Sept!B:B,MATCH(Year!A:A,Sept!A:A,0)),\"\")","v":""},{"$f":"IFERROR(INDEX(Oct!B:B,MATCH(Year!A:A,Oct!A:A,0)),\"\")","v":""},{"$f":"IFERROR(INDEX(Nov!B:B,MATCH(Year!A:A,Nov!A:A,0)),\"\")","v":""},{"$f":"IFERROR(INDEX(Dec!B:B,MATCH(Year!A:A,Dec!A:A,0)),\"\")","v":""},{"$f":"IFERROR(INDEX(Jan!B:B,MATCH(Year!A:A,Jan!A:A,0)),\"\")","v":""},{"$f":"IFERROR(INDEX(Feb!B:B,MATCH(Year!A:A,Feb!A:A,0)),\"\")","v":""},{"$f":"IFERROR(INDEX(March!B:B,MATCH(Year!A:A,March!A:A,0)),\"\")","v":""},"",0]
[{"$f":"IF(ISERROR('Audit questions'!A7),\"\",'Audit questions'!A7)","v":"Test6"},{"$f":"IFERROR(INDEX(April!B:B,MATCH(Year!A:A,April!A:A,0)),\"\")","v":""},{"$f":"IFERROR(INDEX(May!B:B,MATCH(Year!A:A,May!A:A,0)),\"\")","v":""},{"$f":"IFERROR(INDEX(June!B:B,MATCH(Year!A:A,June!A:A,0)),\"\")","v":""},{"$f":"IFERROR(INDEX(July!B:B,MATCH(Year!A:A,July!A:A,0)),\"\")","v":""},{"$f":"IFERROR(INDEX(Aug!B:B,MATCH(Year!A:A,Aug!A:A,0)),\"\")","v":""},{"$f":"IFERROR(INDEX(Sept!B:B,MATCH(Year!A:A,Sept!A:A,0)),\"\")","v":""},{"$f":"IFERROR(INDEX(Oct!B:B,MATCH(Year!A:A,Oct!A:A,0)),\"\")","v":""},{"$f":"IFERROR(INDEX(Nov!B:B,MATCH(Year!A:A,Nov!A:A,0)),\"\")","v":""},{"$f":"IFERROR(INDEX(Dec!B:B,MATCH(Year!A:A,Dec!A:A,0)),\"\")","v":""},{"$f":"IFERROR(INDEX(Jan!B:B,MATCH(Year!A:A,Jan!A:A,0)),\"\")","v":""},{"$f":"IFERROR(INDEX(Feb!B:B,MATCH(Year!A:A,Feb!A:A,0)),\"\")","v":""},{"$f":"IFERROR(INDEX(March!B:B,MATCH(Year!A:A,March!A:A,0)),\"\")","v":""},"",0]
[{"$f":"IF(ISERROR('Audit questions'!A8),\"\",'Audit questions'!A8)","v":"Test7"},{"$f":"IFERROR(INDEX(April!B:B,MATCH(Year!A:A,April!A:A,0)),\"\")","v":""},{"$f":"IFERROR(INDEX(May!B:B,MATCH(Year!A:A,May!A:A,0)),\"\")","v":""},{"$f":"IFERROR(INDEX(June!B:B,MATCH(Year!A:A,June!A:A,0)),\"\")","v":""},{"$f":"IFERROR(INDEX(July!B:B,MATCH(Year!A:A,July!A:A,0)),\"\")","v":""},{"$f":"IFERROR(INDEX(Aug!B:B,MATCH(Year!A:A,Aug!A:A,0)),\"\")","v":""},{"$f":"IFERROR(INDEX(Sept!B:B,MATCH(Year!A:A,Sept!A:A,0)),\"\")","v":""},{"$f":"IFERROR(INDEX(Oct!B:B,MATCH(Year!A:A,Oct!A:A,0)),\"\")","v":""},{"$f":"IFERROR(INDEX(Nov!B:B,MATCH(Year!A:A,Nov!A:A,0)),\"\")","v":""},{"$f":"IFERROR(INDEX(Dec!B:B,MATCH(Year!A:A,Dec!A:A,0)),\"\")","v":""},{"$f":"IFERROR(INDEX(Jan!B:B,MATCH(Year!A:A,Jan!A:A,0)),\"\")","v":""},{"$f":"IFERROR(INDEX(Feb!B:B,MATCH(Year!A:A,Feb!A:A,0)),\"\")","v":""},{"$f":"IFERROR(INDEX(March!B:B,MATCH(Year!A:A,March!A:A,0)),\"\")","v":""},"",0]
[{"$f":"IF(ISERROR('Audit questions'!A9),\"\",'Audit questions'!A9)","v":"Test8"},{"$f":"IFERROR(INDEX(April!B:B,MATCH(Year!A:A,April!A:A,0)),\"\")","v":""},{"$f":"IFERROR(INDEX(May!B:B,MATCH(Year!A:A,May!A:A,0)),\"\")","v":""},{"$f":"IFERROR(INDEX(June!B:B,MATCH(Year!A:A,June!A:A,0)),\"\")","v":""},{"$f":"IFERROR(INDEX(July!B:B,MATCH(Year!A:A,July!A:A,0)),\"\")","v":""},{"$f":"IFERROR(INDEX(Aug!B:B,MATCH(Year!A:A,Aug!A:A,0)),\"\")","v":""},{"$f":"IFERROR(INDEX(Sept!B:B,MATCH(Year!A:A,Sept!A:A,0)),\"\")","v":""},{"$f":"IFERROR(INDEX(Oct!B:B,MATCH(Year!A:A,Oct!A:A,0)),\"\")","v":""},{"$f":"IFERROR(INDEX(Nov!B:B,MATCH(Year!A:A,Nov!A:A,0)),\"\")","v":""},{"$f":"IFERROR(INDEX(Dec!B:B,MATCH(Year!A:A,Dec!A:A,0)),\"\")","v":""},{"$f":"IFERROR(INDEX(Jan!B:B,MATCH(Year!A:A,Jan!A:A,0)),\"\")","v":""},{"$f":"IFERROR(INDEX(Feb!B:B,MATCH(Year!A:A,Feb!A:A,0)),\"\")","v":""},{"$f":"IFERROR(INDEX(March!B:B,MATCH(Year!A:A,March!A:A,0)),\"\")","v":""},"",0]
[{"$f":"IF(ISERROR('Audit questions'!A10),\"\",'Audit questions'!A10)","v":"Test9"},{"$f":"IFERROR(INDEX(April!B:B,MATCH(Year!A:A,April!A:A,0)),\"\")","v":""},{"$f":"IFERROR(INDEX(May!B:B,MATCH(Year!A:A,May!A:A,0)),\"\")","v":""},{"$f":"IFERROR(INDEX(June!B:B,MATCH(Year!A:A,June!A:A,0)),\"\")","v":""},{"$f":"IFERROR(INDEX(July!B:B,MATCH(Year!A:A,July!A:A,0)),\"\")","v":""},{"$f":"IFERROR(INDEX(Aug!B:B,MATCH(Year!A:A,Aug!A:A,0)),\"\")","v":""},{"$f":"IFERROR(INDEX(Sept!B:B,MATCH(Year!A:A,Sept!A:A,0)),\"\")","v":""},{"$f":"IFERROR(INDEX(Oct!B:B,MATCH(Year!A:A,Oct!A:A,0)),\"\")","v":""},{"$f":"IFERROR(INDEX(Nov!B:B,MATCH(Year!A:A,Nov!A:A,0)),\"\")","v":""},{"$f":"IFERROR(INDEX(Dec!B:B,MATCH(Year!A:A,Dec!A:A,0)),\"\")","v":""},{"$f":"IFERROR(INDEX(Jan!B:B,MATCH(Year!A:A,Jan!A:A,0)),\"\")","v":""},{"$f":"IFERROR(INDEX(Feb!B:B,MATCH(Year!A:A,Feb!A:A,0)),\"\")","v":""},{"$f":"IFERROR(INDEX(March!B:B,MATCH(Year!A:A,March!A:A,0)),\"\")","v":""},"",0]
[{"$f":"IF(ISERROR('Audit questions'!A11),\"\",'Audit questions'!A11)","v":"Test10"},{"$f":"IFERROR(INDEX(April!B:B,MATCH(Year!A:A,April!A:A,0)),\"\")","v":""},{"$f":"IFERROR(INDEX(May!B:B,MATCH(Year!A:A,May!A:A,0)),\"\")","v":""},{"$f":"IFERROR(INDEX(June!B:B,MATCH(Year!A:A,June!A:A,0)),\"\")","v":""},{"$f":"IFERROR(INDEX(July!B:B,MATCH(Year!A:A,July!A:A,0)),\"\")","v":""},{"$f":"IFERROR(INDEX(Aug!B:B,MATCH(Year!A:A,Aug!A:A,0)),\"\")","v":""},{"$f":"IFERROR(INDEX(Sept!B:B,MATCH(Year!A:A,Sept!A:A,0)),\"\")","v":""},{"$f":"IFERROR(INDEX(Oct!B:B,MATCH(Year!A:A,Oct!A:A,0)),\"\")","v":""},{"$f":"IFERROR(INDEX(Nov!B:B,MATCH(Year!A:A,Nov!A:A,0)),\"\")","v":""},{"$f":"IFERROR(INDEX(Dec!B:B,MATCH(Year!A:A,Dec!A:A,0)),\"\")","v":""},{"$f":"IFERROR(INDEX(Jan!B:B,MATCH(Year!A:A,Jan!A:A,0)),\"\")","v":""},{"$f":"IFERROR(INDEX(Feb!B:B,MATCH(Year!A:A,Feb!A:A,0)),\"\")","v":""},{"$f":"IFERROR(INDEX(March!B:B,MATCH(Year!A:A,March!A:A,0)),\"\")","v":""},"",0]
[{"$f":"IF(ISERROR('Audit questions'!A12),\"\",'Audit questions'!A12)","v":"Test11"},{"$f":"IFERROR(INDEX(April!B:B,MATCH(Year!A:A,April!A:A,0)),\"\")","v":""},{"$f":"IFERROR(INDEX(May!B:B,MATCH(Year!A:A,May!A:A,0)),\"\")","v":""},{"$f":"IFERROR(INDEX(June!B:B,MATCH(Year!A:A,June!A:A,0)),\"\")","v":""},{"$f":"IFERROR(INDEX(July!B:B,MATCH(Year!A:A,July!A:A,0)),\"\")","v":""},{"$f":"IFERROR(INDEX(Aug!B:B,MATCH(Year!A:A,Aug!A:A,0)),\"\")","v":""},{"$f":"IFERROR(INDEX(Sept!B:B,MATCH(Year!A:A,Sept!A:A,0)),\"\")","v":""},{"$f":"IFERROR(INDEX(Oct!B:B,MATCH(Year!A:A,Oct!A:A,0)),\"\")","v":""},{"$f":"IFERROR(INDEX(Nov!B:B,MATCH(Year!A:A,Nov!A:A,0)),\"\")","v":""},{"$f":"IFERROR(INDEX(Dec!B:B,MATCH(Year!A:A,Dec!A:A,0)),\"\")","v":""},{"$f":"IFERROR(INDEX(Jan!B:B,MATCH(Year!A:A,Jan!A:A,0)),\"\")","v":""},{"$f":"IFERROR(INDEX(Feb!B:B,MATCH(Year!A:A,Feb!A:A,0)),\"\")","v":""},{"$f":"IFERROR(INDEX(March!B:B,MATCH(Year!A:A,March!A:A,0)),\"\")","v":""},"",0]
[{"$f":"IF(ISERROR('Audit questions'!A13),\"\",'Audit questions'!A13)","v":"Test12"},{"$f":"IFERROR(INDEX(April!B:B,MATCH(Year!A:A,April!A:A,0)),\"\")","v":""},{"$f":"IFERROR(INDEX(May!B:B,MATCH(Year!A:A,May!A:A,0)),\"\")","v":""},{"$f":"IFERROR(INDEX(June!B:B,MATCH(Year!A:A,June!A:A,0)),\"\")","v":""},{"$f":"IFERROR(INDEX(July!B:B,MATCH(Year!A:A,July!A:A,0)),\"\")","v":""},{"$f":"IFERROR(INDEX(Aug!B:B,MATCH(Year!A:A,Aug!A:A,0)),\"\")","v":""},{"$f":"IFERROR(INDEX(Sept!B:B,MATCH(Year!A:A,Sept!A:A,0)),\"\")","v":""},{"$f":"IFERROR(INDEX(Oct!B:B,MATCH(Year!A:A,Oct!A:A,0)),\"\")","v":""},{"$f":"IFERROR(INDEX(Nov!B:B,MATCH(Year!A:A,Nov!A:A,0)),\"\")","v":""},{"$f":"IFERROR(INDEX(Dec!B:B,MATCH(Year!A:A,Dec!A:A,0)),\"\")","v":""},{"$f":"IFERROR(INDEX(Jan!B:B,MATCH(Year!A:A,Jan!A:A,0)),\"\")","v":""},{"$f":"IFERROR(INDEX(Feb!B:B,MATCH(Year!A:A,Feb!A:A,0)),\"\")","v":""},{"$f":"IFERROR(INDEX(March!B:B,MATCH(Year!A:A,March!A:A,0)),\"\")","v":""},"",0]
[{"$f":"IF(ISERROR('Audit questions'!A14),\"\",'Audit questions'!A14)","v":"Test13"},{"$f":"IFERROR(INDEX(April!B:B,MATCH(Year!A:A,April!A:A,0)),\"\")","v":""},{"$f":"IFERROR(INDEX(May!B:B,MATCH(Year!A:A,May!A:A,0)),\"\")","v":""},{"$f":"IFERROR(INDEX(June!B:B,MATCH(Year!A:A,June!A:A,0)),\"\")","v":""},{"$f":"IFERROR(INDEX(July!B:B,MATCH(Year!A:A,July!A:A,0)),\"\")","v":""},{"$f":"IFERROR(INDEX(Aug!B:B,MATCH(Year!A:A,Aug!A:A,0)),\"\")","v":""},{"$f":"IFERROR(INDEX(Sept!B:B,MATCH(Year!A:A,Sept!A:A,0)),\"\")","v":""},{"$f":"IFERROR(INDEX(Oct!B:B,MATCH(Year!A:A,Oct!A:A,0)),\"\")","v":""},{"$f":"IFERROR(INDEX(Nov!B:B,MATCH(Year!A:A,Nov!A:A,0)),\"\")","v":""},{"$f":"IFERROR(INDEX(Dec!B:B,MATCH(Year!A:A,Dec!A:A,0)),\"\")","v":""},{"$f":"IFERROR(INDEX(Jan!B:B,MATCH(Year!A:A,Jan!A:A,0)),\"\")","v":""},{"$f":"IFERROR(INDEX(Feb!B:B,MATCH(Year!A:A,Feb!A:A,0)),\"\")","v":""},{"$f":"IFERROR(INDEX(March!B:B,MATCH(Year!A:A,March!A:A,0)),\"\")","v":""},"",0]
[{"$f":"IF(ISERROR('Audit questions'!A15),\"\",'Audit questions'!A15)","v":"Test14"},{"$f":"IFERROR(INDEX(April!B:B,MATCH(Year!A:A,April!A:A,0)),\"\")","v":""},{"$f":"IFERROR(INDEX(May!B:B,MATCH(Year!A:A,May!A:A,0)),\"\")","v":""},{"$f":"IFERROR(INDEX(June!B:B,MATCH(Year!A:A,June!A:A,0)),\"\")","v":""},{"$f":"IFERROR(INDEX(July!B:B,MATCH(Year!A:A,July!A:A,0)),\"\")","v":""},{"$f":"IFERROR(INDEX(Aug!B:B,MATCH(Year!A:A,Aug!A:A,0)),\"\")","v":""},{"$f":"IFERROR(INDEX(Sept!B:B,MATCH(Year!A:A,Sept!A:A,0)),\"\")","v":""},{"$f":"IFERROR(INDEX(Oct!B:B,MATCH(Year!A:A,Oct!A:A,0)),\"\")","v":""},{"$f":"IFERROR(INDEX(Nov!B:B,MATCH(Year!A:A,Nov!A:A,0)),\"\")","v":""},{"$f":"IFERROR(INDEX(Dec!B:B,MATCH(Year!A:A,Dec!A:A,0)),\"\")","v":""},{"$f":"IFERROR(INDEX(Jan!B:B,MATCH(Year!A:A,Jan!A:A,0)),\"\")","v":""},{"$f":"IFERROR(INDEX(Feb!B:B,MATCH(Year!A:A,Feb!A:A,0)),\"\")","v":""},{"$f":"IFERROR(INDEX(March!B:B,MATCH(Year!A:A,March!A:A,0)),\"\")","v":""},"",0]
[{"$f":"IF(ISERROR('Audit questions'!A16),\"\",'Audit questions'!A16)","v":"Test15"},{"$f":"IFERROR(INDEX(April!B:B,MATCH(Year!A:A,April!A:A,0)),\"\")","v":""},{"$f":"IFERROR(INDEX(May!B:B,MATCH(Year!A:A,May!A:A,0)),\"\")","v":""},{"$f":"IFERROR(INDEX(June!B:B,MATCH(Year!A:A,June!A:A,0)),\"\")","v":""},{"$f":"IFERROR(INDEX(July!B:B,MATCH(Year!A:A,July!A:A,0)),\"\")","v":""},{"$f":"IFERROR(INDEX(Aug!B:B,MATCH(Year!A:A,Aug!A:A,0)),\"\")","v":""},{"$f":"IFERROR(INDEX(Sept!B:B,MATCH(Year!A:A,Sept!A:A,0)),\"\")","v":""},{"$f":"IFERROR(INDEX(Oct!B:B,MATCH(Year!A:A,Oct!A:A,0)),\"\")","v":""},{"$f":"IFERROR(INDEX(Nov!B:B,MATCH(Year!A:A,Nov!A:A,0)),\"\")","v":""},{"$f":"IFERROR(INDEX(Dec!B:B,MATCH(Year!A:A,Dec!A:A,0)),\"\")","v":""},{"$f":"IFERROR(INDEX(Jan!B:B,MATCH(Year!A:A,Jan!A:A,0)),\"\")","v":""},{"$f":"IFERROR(INDEX(Feb!B:B,MATCH(Year!A:A,Feb!A:A,0)),\"\")","v":""},{"$f":"IFERROR(INDEX(March!B:B,MATCH(Year!A:A,March!A:A,0)),\"\")","v":""},"",0]
[{"$f":"IF(ISERROR('Audit questions'!A17),\"\",'Audit questions'!A17)","v":"Test16"},{"$f":"IFERROR(INDEX(April!B:B,MATCH(Year!A:A,April!A:A,0)),\"\")","v":""},{"$f":"IFERROR(INDEX(May!B:B,MATCH(Year!A:A,May!A:A,0)),\"\")","v":""},{"$f":"IFERROR(INDEX(June!B:B,MATCH(Year!A:A,June!A:A,0)),\"\")","v":""},{"$f":"IFERROR(INDEX(July!B:B,MATCH(Year!A:A,July!A:A,0)),\"\")","v":""},{"$f":"IFERROR(INDEX(Aug!B:B,MATCH(Year!A:A,Aug!A:A,0)),\"\")","v":""},{"$f":"IFERROR(INDEX(Sept!B:B,MATCH(Year!A:A,Sept!A:A,0)),\"\")","v":""},{"$f":"IFERROR(INDEX(Oct!B:B,MATCH(Year!A:A,Oct!A:A,0)),\"\")","v":""},{"$f":"IFERROR(INDEX(Nov!B:B,MATCH(Year!A:A,Nov!A:A,0)),\"\")","v":""},{"$f":"IFERROR(INDEX(Dec!B:B,MATCH(Year!A:A,Dec!A:A,0)),\"\")","v":""},{"$f":"IFERROR(INDEX(Jan!B:B,MATCH(Year!A:A,Jan!A:A,0)),\"\")","v":""},{"$f":"IFERROR(INDEX(Feb!B:B,MATCH(Year!A:A,Feb!A:A,0)),\"\")","v":""},{"$f":"IFERROR(INDEX(March!B:B,MATCH(Year!A:A,March!A:A,0)),\"\")","v":""},"",0]
[{"$f":"IF(ISERROR('Audit questions'!A18),\"\",'Audit questions'!A18)","v":"Test17"},{"$f":"IFERROR(INDEX(April!B:B,MATCH(Year!A:A,April!A:A,0)),\"\")","v":""},{"$f":"IFERROR(INDEX(May!B:B,MATCH(Year!A:A,May!A:A,0)),\"\")","v":""},{"$f":"IFERROR(INDEX(June!B:B,MATCH(Year!A:A,June!A:A,0)),\"\")","v":""},{"$f":"IFERROR(INDEX(July!B:B,MATCH(Year!A:A,July!A:A,0)),\"\")","v":""},{"$f":"IFERROR(INDEX(Aug!B:B,MATCH(Year!A:A,Aug!A:A,0)),\"\")","v":""},{"$f":"IFERROR(INDEX(Sept!B:B,MATCH(Year!A:A,Sept!A:A,0)),\"\")","v":""},{"$f":"IFERROR(INDEX(Oct!B:B,MATCH(Year!A:A,Oct!A:A,0)),\"\")","v":""},{"$f":"IFERROR(INDEX(Nov!B:B,MATCH(Year!A:A,Nov!A:A,0)),\"\")","v":""},{"$f":"IFERROR(INDEX(Dec!B:B,MATCH(Year!A:A,Dec!A:A,0)),\"\")","v":""},{"$f":"IFERROR(INDEX(Jan!B:B,MATCH(Year!A:A,Jan!A:A,0)),\"\")","v":""},{"$f":"IFERROR(INDEX(Feb!B:B,MATCH(Year!A:A,Feb!A:A,0)),\"\")","v":""},{"$f":"IFERROR(INDEX(March!B:B,MATCH(Year!A:A,March!A:A,0)),\"\")","v":""},"",0]
[{"$f":"IF(ISERROR('Audit questions'!A19),\"\",'Audit questions'!A19)","v":"Test18"},{"$f":"IFERROR(INDEX(April!B:B,MATCH(Year!A:A,April!A:A,0)),\"\")","v":""},{"$f":"IFERROR(INDEX(May!B:B,MATCH(Year!A:A,May!A:A,0)),\"\")","v":""},{"$f":"IFERROR(INDEX(June!B:B,MATCH(Year!A:A,June!A:A,0)),\"\")","v":""},{"$f":"IFERROR(INDEX(July!B:B,MATCH(Year!A:A,July!A:A,0)),\"\")","v":""},{"$f":"IFERROR(INDEX(Aug!B:B,MATCH(Year!A:A,Aug!A:A,0)),\"\")","v":""},{"$f":"IFERROR(INDEX(Sept!B:B,MATCH(Year!A:A,Sept!A:A,0)),\"\")","v":""},{"$f":"IFERROR(INDEX(Oct!B:B,MATCH(Year!A:A,Oct!A:A,0)),\"\")","v":""},{"$f":"IFERROR(INDEX(Nov!B:B,MATCH(Year!A:A,Nov!A:A,0)),\"\")","v":""},{"$f":"IFERROR(INDEX(Dec!B:B,MATCH(Year!A:A,Dec!A:A,0)),\"\")","v":""},{"$f":"IFERROR(INDEX(Jan!B:B,MATCH(Year!A:A,Jan!A:A,0)),\"\")","v":""},{"$f":"IFERROR(INDEX(Feb!B:B,MATCH(Year!A:A,Feb!A:A,0)),\"\")","v":""},{"$f":"IFERROR(INDEX(March!B:B,MATCH(Year!A:A,March!A:A,0)),\"\")","v":""},"",0]
[{"$f":"IF(ISERROR('Audit questions'!A20),\"\",'Audit questions'!A20)","v":"Test19"},{"$f":"IFERROR(INDEX(April!B:B,MATCH(Year!A:A,April!A:A,0)),\"\")","v":""},{"$f":"IFERROR(INDEX(May!B:B,MATCH(Year!A:A,May!A:A,0)),\"\")","v":""},{"$f":"IFERROR(INDEX(June!B:B,MATCH(Year!A:A,June!A:A,0)),\"\")","v":""},{"$f":"IFERROR(INDEX(July!B:B,MATCH(Year!A:A,July!A:A,0)),\"\")","v":""},{"$f":"IFERROR(INDEX(Aug!B:B,MATCH(Year!A:A,Aug!A:A,0)),\"\")","v":""},{"$f":"IFERROR(INDEX(Sept!B:B,MATCH(Year!A:A,Sept!A:A,0)),\"\")","v":""},{"$f":"IFERROR(INDEX(Oct!B:B,MATCH(Year!A:A,Oct!A:A,0)),\"\")","v":""},{"$f":"IFERROR(INDEX(Nov!B:B,MATCH(Year!A:A,Nov!A:A,0)),\"\")","v":""},{"$f":"IFERROR(INDEX(Dec!B:B,MATCH(Year!A:A,Dec!A:A,0)),\"\")","v":""},{"$f":"IFERROR(INDEX(Jan!B:B,MATCH(Year!A:A,Jan!A:A,0)),\"\")","v":""},{"$f":"IFERROR(INDEX(Feb!B:B,MATCH(Year!A:A,Feb!A:A,0)),\"\")","v":""},{"$f":"IFERROR(INDEX(March!B:B,MATCH(Year!A:A,March!A:A,0)),\"\")","v":""},"",0]
[{"$f":"IF(ISERROR('Audit questions'!A21),\"\",'Audit questions'!A21)","v":"Test20"},{"$f":"IFERROR(INDEX(April!B:B,MATCH(Year!A:A,April!A:A,0)),\"\")","v":""},{"$f":"IFERROR(INDEX(May!B:B,MATCH(Year!A:A,May!A:A,0)),\"\")","v":""},{"$f":"IFERROR(INDEX(June!B:B,MATCH(Year!A:A,June!A:A,0)),\"\")","v":""},{"$f":"IFERROR(INDEX(July!B:B,MATCH(Year!A:A,July!A:A,0)),\"\")","v":""},{"$f":"IFERROR(INDEX(Aug!B:B,MATCH(Year!A:A,Aug!A:A,0)),\"\")","v":""},{"$f":"IFERROR(INDEX(Sept!B:B,MATCH(Year!A:A,Sept!A:A,0)),\"\")","v":""},{"$f":"IFERROR(INDEX(Oct!B:B,MATCH(Year!A:A,Oct!A:A,0)),\"\")","v":""},{"$f":"IFERROR(INDEX(Nov!B:B,MATCH(Year!A:A,Nov!A:A,0)),\"\")","v":""},{"$f":"IFERROR(INDEX(Dec!B:B,MATCH(Year!A:A,Dec!A:A,0)),\"\")","v":""},{"$f":"IFERROR(INDEX(Jan!B:B,MATCH(Year!A:A,Jan!A:A,0)),\"\")","v":""},{"$f":"IFERROR(INDEX(Feb!B:B,MATCH(Year!A:A,Feb!A:A,0)),\"\")","v":""},{"$f":"IFERROR(INDEX(March!B:B,MATCH(Year!A:A,March!A:A,0)),\"\")","v":""},"",0]
[{"$f":"IF(ISERROR('Audit questions'!A22),\"\",'Audit questions'!A22)","v":"Test21"},{"$f":"IFERROR(INDEX(April!B:B,MATCH(Year!A:A,April!A:A,0)),\"\")","v":""},{"$f":"IFERROR(INDEX(May!B:B,MATCH(Year!A:A,May!A:A,0)),\"\")","v":""},{"$f":"IFERROR(INDEX(June!B:B,MATCH(Year!A:A,June!A:A,0)),\"\")","v":""},{"$f":"IFERROR(INDEX(July!B:B,MATCH(Year!A:A,July!A:A,0)),\"\")","v":""},{"$f":"IFERROR(INDEX(Aug!B:B,MATCH(Year!A:A,Aug!A:A,0)),\"\")","v":""},{"$f":"IFERROR(INDEX(Sept!B:B,MATCH(Year!A:A,Sept!A:A,0)),\"\")","v":""},{"$f":"IFERROR(INDEX(Oct!B:B,MATCH(Year!A:A,Oct!A:A,0)),\"\")","v":""},{"$f":"IFERROR(INDEX(Nov!B:B,MATCH(Year!A:A,Nov!A:A,0)),\"\")","v":""},{"$f":"IFERROR(INDEX(Dec!B:B,MATCH(Year!A:A,Dec!A:A,0)),\"\")","v":""},{"$f":"IFERROR(INDEX(Jan!B:B,MATCH(Year!A:A,Jan!A:A,0)),\"\")","v":""},{"$f":"IFERROR(INDEX(Feb!B:B,MATCH(Year!A:A,Feb!A:A,0)),\"\")","v":""},{"$f":"IFERROR(INDEX(March!B:B,MATCH(Year!A:A,March!A:A,0)),\"\")","v":""},"",0]
[{"$f":"IF(ISERROR('Audit questions'!A23),\"\",'Audit questions'!A23)","v":"Test22"},{"$f":"IFERROR(INDEX(April!B:B,MATCH(Year!A:A,April!A:A,0)),\"\")","v":""},{"$f":"IFERROR(INDEX(May!B:B,MATCH(Year!A:A,May!A:A,0)),\"\")","v":""},{"$f":"IFERROR(INDEX(June!B:B,MATCH(Year!A:A,June!A:A,0)),\"\")","v":""},{"$f":"IFERROR(INDEX(July!B:B,MATCH(Year!A:A,July!A:A,0)),\"\")","v":""},{"$f":"IFERROR(INDEX(Aug!B:B,MATCH(Year!A:A,Aug!A:A,0)),\"\")","v":""},{"$f":"IFERROR(INDEX(Sept!B:B,MATCH(Year!A:A,Sept!A:A,0)),\"\")","v":""},{"$f":"IFERROR(INDEX(Oct!B:B,MATCH(Year!A:A,Oct!A:A,0)),\"\")","v":""},{"$f":"IFERROR(INDEX(Nov!B:B,MATCH(Year!A:A,Nov!A:A,0)),\"\")","v":""},{"$f":"IFERROR(INDEX(Dec!B:B,MATCH(Year!A:A,Dec!A:A,0)),\"\")","v":""},{"$f":"IFERROR(INDEX(Jan!B:B,MATCH(Year!A:A,Jan!A:A,0)),\"\")","v":""},{"$f":"IFERROR(INDEX(Feb!B:B,MATCH(Year!A:A,Feb!A:A,0)),\"\")","v":""},{"$f":"IFERROR(INDEX(March!B:B,MATCH(Year!A:A,March!A:A,0)),\"\")","v":""},"",0]
[{"$f":"IF(ISERROR('Audit questions'!A24),\"\",'Audit questions'!A24)","v":"Test23"},{"$f":"IFERROR(INDEX(April!B:B,MATCH(Year!A:A,April!A:A,0)),\"\")","v":""},{"$f":"IFERROR(INDEX(May!B:B,MATCH(Year!A:A,May!A:A,0)),\"\")","v":""},{"$f":"IFERROR(INDEX(June!B:B,MATCH(Year!A:A,June!A:A,0)),\"\")","v":""},{"$f":"IFERROR(INDEX(July!B:B,MATCH(Year!A:A,July!A:A,0)),\"\")","v":""},{"$f":"IFERROR(INDEX(Aug!B:B,MATCH(Year!A:A,Aug!A:A,0)),\"\")","v":""},{"$f":"IFERROR(INDEX(Sept!B:B,MATCH(Year!A:A,Sept!A:A,0)),\"\")","v":""},{"$f":"IFERROR(INDEX(Oct!B:B,MATCH(Year!A:A,Oct!A:A,0)),\"\")","v":""},{"$f":"IFERROR(INDEX(Nov!B:B,MATCH(Year!A:A,Nov!A:A,0)),\"\")","v":""},{"$f":"IFERROR(INDEX(Dec!B:B,MATCH(Year!A:A,Dec!A:A,0)),\"\")","v":""},{"$f":"IFERROR(INDEX(Jan!B:B,MATCH(Year!A:A,Jan!A:A,0)),\"\")","v":""},{"$f":"IFERROR(INDEX(Feb!B:B,MATCH(Year!A:A,Feb!A:A,0)),\"\")","v":""},{"$f":"IFERROR(INDEX(March!B:B,MATCH(Year!A:A,March!A:A,0)),\"\")","v":""},"",0]
[{"$f":"IF(ISERROR('Audit questions'!A25),\"\",'Audit questions'!A25)","v":"Test24"},{"$f":"IFERROR(INDEX(April!B:B,MATCH(Year!A:A,April!A:A,0)),\"\")","v":""},{"$f":"IFERROR(INDEX(May!B:B,MATCH(Year!A:A,May!A:A,0)),\"\")","v":""},{"$f":"IFERROR(INDEX(June!B:B,MATCH(Year!A:A,June!A:A,0)),\"\")","v":""},{"$f":"IFERROR(INDEX(July!B:B,MATCH(Year!A:A,July!A:A,0)),\"\")","v":""},{"$f":"IFERROR(INDEX(Aug!B:B,MATCH(Year!A:A,Aug!A:A,0)),\"\")","v":""},{"$f":"IFERROR(INDEX(Sept!B:B,MATCH(Year!A:A,Sept!A:A,0)),\"\")","v":""},{"$f":"IFERROR(INDEX(Oct!B:B,MATCH(Year!A:A,Oct!A:A,0)),\"\")","v":""},{"$f":"IFERROR(INDEX(Nov!B:B,MATCH(Year!A:A,Nov!A:A,0)),\"\")","v":""},{"$f":"IFERROR(INDEX(Dec!B:B,MATCH(Year!A:A,Dec!A:A,0)),\"\")","v":""},{"$f":"IFERROR(INDEX(Jan!B:B,MATCH(Year!A:A,Jan!A:A,0)),\"\")","v":""},{"$f":"IFERROR(INDEX(Feb!B:B,MATCH(Year!A:A,Feb!A:A,0)),\"\")","v":""},{"$f":"IFERROR(INDEX(March!B:B,MATCH(Year!A:A,March!A:A,0)),\"\")","v":""},"",0]
[{"$f":"IF(ISERROR('Audit questions'!A26),\"\",'Audit questions'!A26)","v":"Test25"},{"$f":"IFERROR(INDEX(April!B:B,MATCH(Year!A:A,April!A:A,0)),\"\")","v":""},{"$f":"IFERROR(INDEX(May!B:B,MATCH(Year!A:A,May!A:A,0)),\"\")","v":""},{"$f":"IFERROR(INDEX(June!B:B,MATCH(Year!A:A,June!A:A,0)),\"\")","v":""},{"$f":"IFERROR(INDEX(July!B:B,MATCH(Year!A:A,July!A:A,0)),\"\")","v":""},{"$f":"IFERROR(INDEX(Aug!B:B,MATCH(Year!A:A,Aug!A:A,0)),\"\")","v":""},{"$f":"IFERROR(INDEX(Sept!B:B,MATCH(Year!A:A,Sept!A:A,0)),\"\")","v":""},{"$f":"IFERROR(INDEX(Oct!B:B,MATCH(Year!A:A,Oct!A:A,0)),\"\")","v":""},{"$f":"IFERROR(INDEX(Nov!B:B,MATCH(Year!A:A,Nov!A:A,0)),\"\")","v":""},{"$f":"IFERROR(INDEX(Dec!B:B,MATCH(Year!A:A,Dec!A:A,0)),\"\")","v":""},{"$f":"IFERROR(INDEX(Jan!B:B,MATCH(Year!A:A,Jan!A:A,0)),\"\")","v":""},{"$f":"IFERROR(INDEX(Feb!B:B,MATCH(Year!A:A,Feb!A:A,0)),\"\")","v":""},{"$f":"IFERROR(INDEX(March!B:B,MATCH(Year!A:A,March!A:A,0)),\"\")","v":""},"",0]
[{"$f":"IF(ISERROR('Audit questions'!A27),\"\",'Audit questions'!A27)","v":"Test26"},{"$f":"IFERROR(INDEX(April!B:B,MATCH(Year!A:A,April!A:A,0)),\"\")","v":""},{"$f":"IFERROR(INDEX(May!B:B,MATCH(Year!A:A,May!A:A,0)),\"\")","v":""},{"$f":"IFERROR(INDEX(June!B:B,MATCH(Year!A:A,June!A:A,0)),\"\")","v":""},{"$f":"IFERROR(INDEX(July!B:B,MATCH(Year!A:A,July!A:A,0)),\"\")","v":""},{"$f":"IFERROR(INDEX(Aug!B:B,MATCH(Year!A:A,Aug!A:A,0)),\"\")","v":""},{"$f":"IFERROR(INDEX(Sept!B:B,MATCH(Year!A:A,Sept!A:A,0)),\"\")","v":""},{"$f":"IFERROR(INDEX(Oct!B:B,MATCH(Year!A:A,Oct!A:A,0)),\"\")","v":""},{"$f":"IFERROR(INDEX(Nov!B:B,MATCH(Year!A:A,Nov!A:A,0)),\"\")","v":""},{"$f":"IFERROR(INDEX(Dec!B:B,MATCH(Year!A:A,Dec!A:A,0)),\"\")","v":""},{"$f":"IFERROR(INDEX(Jan!B:B,MATCH(Year!A:A,Jan!A:A,0)),\"\")","v":""},{"$f":"IFERROR(INDEX(Feb!B:B,MATCH(Year!A:A,Feb!A:A,0)),\"\")","v":""},{"$f":"IFERROR(INDEX(March!B:B,MATCH(Year!A:A,March!A:A,0)),\"\")","v":""},"",0]
[{"$f":"IF(ISERROR('Audit questions'!A28),\"\",'Audit questions'!A28)","v":"Test27"},{"$f":"IFERROR(INDEX(April!B:B,MATCH(Year!A:A,April!A:A,0)),\"\")","v":""},{"$f":"IFERROR(INDEX(May!B:B,MATCH(Year!A:A,May!A:A,0)),\"\")","v":""},{"$f":"IFERROR(INDEX(June!B:B,MATCH(Year!A:A,June!A:A,0)),\"\")","v":""},{"$f":"IFERROR(INDEX(July!B:B,MATCH(Year!A:A,July!A:A,0)),\"\")","v":""},{"$f":"IFERROR(INDEX(Aug!B:B,MATCH(Year!A:A,Aug!A:A,0)),\"\")","v":""},{"$f":"IFERROR(INDEX(Sept!B:B,MATCH(Year!A:A,Sept!A:A,0)),\"\")","v":""},{"$f":"IFERROR(INDEX(Oct!B:B,MATCH(Year!A:A,Oct!A:A,0)),\"\")","v":""},{"$f":"IFERROR(INDEX(Nov!B:B,MATCH(Year!A:A,Nov!A:A,0)),\"\")","v":""},{"$f":"IFERROR(INDEX(Dec!B:B,MATCH(Year!A:A,Dec!A:A,0)),\"\")","v":""},{"$f":"IFERROR(INDEX(Jan!B:B,MATCH(Year!A:A,Jan!A:A,0)),\"\")","v":""},{"$f":"IFERROR(INDEX(Feb!B:B,MATCH(Year!A:A,Feb!A:A,0)),\"\")","v":""},{"$f":"IFERROR(INDEX(March!B:B,MATCH(Year!A:A,March!A:A,0)),\"\")","v":""},"",0]
[{"$f":"IF(ISERROR('Audit questions'!A29),\"\",'Audit questions'!A29)","v":"Test28"},{"$f":"IFERROR(INDEX(April!B:B,MATCH(Year!A:A,April!A:A,0)),\"\")","v":""},{"$f":"IFERROR(INDEX(May!B:B,MATCH(Year!A:A,May!A:A,0)),\"\")","v":""},{"$f":"IFERROR(INDEX(June!B:B,MATCH(Year!A:A,June!A:A,0)),\"\")","v":""},{"$f":"IFERROR(INDEX(July!B:B,MATCH(Year!A:A,July!A:A,0)),\"\")","v":""},{"$f":"IFERROR(INDEX(Aug!B:B,MATCH(Year!A:A,Aug!A:A,0)),\"\")","v":""},{"$f":"IFERROR(INDEX(Sept!B:B,MATCH(Year!A:A,Sept!A:A,0)),\"\")","v":""},{"$f":"IFERROR(INDEX(Oct!B:B,MATCH(Year!A:A,Oct!A:A,0)),\"\")","v":""},{"$f":"IFERROR(INDEX(Nov!B:B,MATCH(Year!A:A,Nov!A:A,0)),\"\")","v":""},{"$f":"IFERROR(INDEX(Dec!B:B,MATCH(Year!A:A,Dec!A:A,0)),\"\")","v":""},{"$f":"IFERROR(INDEX(Jan!B:B,MATCH(Year!A:A,Jan!A:A,0)),\"\")","v":""},{"$f":"IFERROR(INDEX(Feb!B:B,MATCH(Year!A:A,Feb!A:A,0)),\"\")","v":""},{"$f":"IFERROR(INDEX(March!B:B,MATCH(Year!A:A,March!A:A,0)),\"\")","v":""},"",0]
[{"$f":"IF(ISERROR('Audit questions'!A30),\"\",'Audit questions'!A30)","v":"Test29"},{"$f":"IFERROR(INDEX(April!B:B,MATCH(Year!A:A,April!A:A,0)),\"\")","v":""},{"$f":"IFERROR(INDEX(May!B:B,MATCH(Year!A:A,May!A:A,0)),\"\")","v":""},{"$f":"IFERROR(INDEX(June!B:B,MATCH(Year!A:A,June!A:A,0)),\"\")","v":""},{"$f":"IFERROR(INDEX(July!B:B,MATCH(Year!A:A,July!A:A,0)),\"\")","v":""},{"$f":"IFERROR(INDEX(Aug!B:B,MATCH(Year!A:A,Aug!A:A,0)),\"\")","v":""},{"$f":"IFERROR(INDEX(Sept!B:B,MATCH(Year!A:A,Sept!A:A,0)),\"\")","v":""},{"$f":"IFERROR(INDEX(Oct!B:B,MATCH(Year!A:A,Oct!A:A,0)),\"\")","v":""},{"$f":"IFERROR(INDEX(Nov!B:B,MATCH(Year!A:A,Nov!A:A,0)),\"\")","v":""},{"$f":"IFERROR(INDEX(Dec!B:B,MATCH(Year!A:A,Dec!A:A,0)),\"\")","v":""},{"$f":"IFERROR(INDEX(Jan!B:B,MATCH(Year!A:A,Jan!A:A,0)),\"\")","v":""},{"$f":"IFERROR(INDEX(Feb!B:B,MATCH(Year!A:A,Feb!A:A,0)),\"\")","v":""},{"$f":"IFERROR(INDEX(March!B:B,MATCH(Year!A:A,March!A:A,0)),\"\")","v":""},"",0]
[{"$f":"IF(ISERROR('Audit questions'!A31),\"\",'Audit questions'!A31)","v":"Test30"},{"$f":"IFERROR(INDEX(April!B:B,MATCH(Year!A:A,April!A:A,0)),\"\")","v":""},{"$f":"IFERROR(INDEX(May!B:B,MATCH(Year!A:A,May!A:A,0)),\"\")","v":""},{"$f":"IFERROR(INDEX(June!B:B,MATCH(Year!A:A,June!A:A,0)),\"\")","v":""},{"$f":"IFERROR(INDEX(July!B:B,MATCH(Year!A:A,July!A:A,0)),\"\")","v":""},{"$f":"IFERROR(INDEX(Aug!B:B,MATCH(Year!A:A,Aug!A:A,0)),\"\")","v":""},{"$f":"IFERROR(INDEX(Sept!B:B,MATCH(Year!A:A,Sept!A:A,0)),\"\")","v":""},{"$f":"IFERROR(INDEX(Oct!B:B,MATCH(Year!A:A,Oct!A:A,0)),\"\")","v":""},{"$f":"IFERROR(INDEX(Nov!B:B,MATCH(Year!A:A,Nov!A:A,0)),\"\")","v":""},{"$f":"IFERROR(INDEX(Dec!B:B,MATCH(Year!A:A,Dec!A:A,0)),\"\")","v":""},{"$f":"IFERROR(INDEX(Jan!B:B,MATCH(Year!A:A,Jan!A:A,0)),\"\")","v":""},{"$f":"IFERROR(INDEX(Feb!B:B,MATCH(Year!A:A,Feb!A:A,0)),\"\")","v":""},{"$f":"IFERROR(INDEX(March!B:B,MATCH(Year!A:A,March!A:A,0)),\"\")","v":""},"",0]
[{"$f":"IF(ISERROR('Audit questions'!A32),\"\",'Audit questions'!A32)","v":"Test31"},{"$f":"IFERROR(INDEX(April!B:B,MATCH(Year!A:A,April!A:A,0)),\"\")","v":""},{"$f":"IFERROR(INDEX(May!B:B,MATCH(Year!A:A,May!A:A,0)),\"\")","v":""},{"$f":"IFERROR(INDEX(June!B:B,MATCH(Year!A:A,June!A:A,0)),\"\")","v":""},{"$f":"IFERROR(INDEX(July!B:B,MATCH(Year!A:A,July!A:A,0)),\"\")","v":""},{"$f":"IFERROR(INDEX(Aug!B:B,MATCH(Year!A:A,Aug!A:A,0)),\"\")","v":""},{"$f":"IFERROR(INDEX(Sept!B:B,MATCH(Year!A:A,Sept!A:A,0)),\"\")","v":""},{"$f":"IFERROR(INDEX(Oct!B:B,MATCH(Year!A:A,Oct!A:A,0)),\"\")","v":""},{"$f":"IFERROR(INDEX(Nov!B:B,MATCH(Year!A:A,Nov!A:A,0)),\"\")","v":""},{"$f":"IFERROR(INDEX(Dec!B:B,MATCH(Year!A:A,Dec!A:A,0)),\"\")","v":""},{"$f":"IFERROR(INDEX(Jan!B:B,MATCH(Year!A:A,Jan!A:A,0)),\"\")","v":""},{"$f":"IFERROR(INDEX(Feb!B:B,MATCH(Year!A:A,Feb!A:A,0)),\"\")","v":""},{"$f":"IFERROR(INDEX(March!B:B,MATCH(Year!A:A,March!A:A,0)),\"\")","v":""},"",0]
[{"$f":"IF(ISERROR('Audit questions'!A33),\"\",'Audit questions'!A33)","v":"Test32"},{"$f":"IFERROR(INDEX(April!B:B,MATCH(Year!A:A,April!A:A,0)),\"\")","v":""},{"$f":"IFERROR(INDEX(May!B:B,MATCH(Year!A:A,May!A:A,0)),\"\")","v":""},{"$f":"IFERROR(INDEX(June!B:B,MATCH(Year!A:A,June!A:A,0)),\"\")","v":""},{"$f":"IFERROR(INDEX(July!B:B,MATCH(Year!A:A,July!A:A,0)),\"\")","v":""},{"$f":"IFERROR(INDEX(Aug!B:B,MATCH(Year!A:A,Aug!A:A,0)),\"\")","v":""},{"$f":"IFERROR(INDEX(Sept!B:B,MATCH(Year!A:A,Sept!A:A,0)),\"\")","v":""},{"$f":"IFERROR(INDEX(Oct!B:B,MATCH(Year!A:A,Oct!A:A,0)),\"\")","v":""},{"$f":"IFERROR(INDEX(Nov!B:B,MATCH(Year!A:A,Nov!A:A,0)),\"\")","v":""},{"$f":"IFERROR(INDEX(Dec!B:B,MATCH(Year!A:A,Dec!A:A,0)),\"\")","v":""},{"$f":"IFERROR(INDEX(Jan!B:B,MATCH(Year!A:A,Jan!A:A,0)),\"\")","v":""},{"$f":"IFERROR(INDEX(Feb!B:B,MATCH(Year!A:A,Feb!A:A,0)),\"\")","v":""},{"$f":"IFERROR(INDEX(March!B:B,MATCH(Year!A:A,March!A:A,0)),\"\")","v":""},"",0]
[{"$f":"IF(ISERROR('Audit questions'!A34),\"\",'Audit questions'!A34)","v":"Test33"},{"$f":"IFERROR(INDEX(April!B:B,MATCH(Year!A:A,April!A:A,0)),\"\")","v":""},{"$f":"IFERROR(INDEX(May!B:B,MATCH(Year!A:A,May!A:A,0)),\"\")","v":""},{"$f":"IFERROR(INDEX(June!B:B,MATCH(Year!A:A,June!A:A,0)),\"\")","v":""},{"$f":"IFERROR(INDEX(July!B:B,MATCH(Year!A:A,July!A:A,0)),\"\")","v":""},{"$f":"IFERROR(INDEX(Aug!B:B,MATCH(Year!A:A,Aug!A:A,0)),\"\")","v":""},{"$f":"IFERROR(INDEX(Sept!B:B,MATCH(Year!A:A,Sept!A:A,0)),\"\")","v":""},{"$f":"IFERROR(INDEX(Oct!B:B,MATCH(Year!A:A,Oct!A:A,0)),\"\")","v":""},{"$f":"IFERROR(INDEX(Nov!B:B,MATCH(Year!A:A,Nov!A:A,0)),\"\")","v":""},{"$f":"IFERROR(INDEX(Dec!B:B,MATCH(Year!A:A,Dec!A:A,0)),\"\")","v":""},{"$f":"IFERROR(INDEX(Jan!B:B,MATCH(Year!A:A,Jan!A:A,0)),\"\")","v":""},{"$f":"IFERROR(INDEX(Feb!B:B,MATCH(Year!A:A,Feb!A:A,0)),\"\")","v":""},{"$f":"IFERROR(INDEX(March!B:B,MATCH(Year!A:A,March!A:A,0)),\"\")","v":""},"",0]
[{"$f":"IF(ISERROR('Audit questions'!A35),\"\",'Audit questions'!A35)","v":"Test34"},{"$f":"IFERROR(INDEX(April!B:B,MATCH(Year!A:A,April!A:A,0)),\"\")","v":""},{"$f":"IFERROR(INDEX(May!B:B,MATCH(Year!A:A,May!A:A,0)),\"\")","v":""},{"$f":"IFERROR(INDEX(June!B:B,MATCH(Year!A:A,June!A:A,0)),\"\")","v":""},{"$f":"IFERROR(INDEX(July!B:B,MATCH(Year!A:A,July!A:A,0)),\"\")","v":""},{"$f":"IFERROR(INDEX(Aug!B:B,MATCH(Year!A:A,Aug!A:A,0)),\"\")","v":""},{"$f":"IFERROR(INDEX(Sept!B:B,MATCH(Year!A:A,Sept!A:A,0)),\"\")","v":""},{"$f":"IFERROR(INDEX(Oct!B:B,MATCH(Year!A:A,Oct!A:A,0)),\"\")","v":""},{"$f":"IFERROR(INDEX(Nov!B:B,MATCH(Year!A:A,Nov!A:A,0)),\"\")","v":""},{"$f":"IFERROR(INDEX(Dec!B:B,MATCH(Year!A:A,Dec!A:A,0)),\"\")","v":""},{"$f":"IFERROR(INDEX(Jan!B:B,MATCH(Year!A:A,Jan!A:A,0)),\"\")","v":""},{"$f":"IFERROR(INDEX(Feb!B:B,MATCH(Year!A:A,Feb!A:A,0)),\"\")","v":""},{"$f":"IFERROR(INDEX(March!B:B,MATCH(Year!A:A,March!A:A,0)),\"\")","v":""},"",0]
[{"$f":"IF(ISERROR('Audit questions'!A36),\"\",'Audit questions'!A36)","v":"Test35"},{"$f":"IFERROR(INDEX(April!B:B,MATCH(Year!A:A,April!A:A,0)),\"\")","v":""},{"$f":"IFERROR(INDEX(May!B:B,MATCH(Year!A:A,May!A:A,0)),\"\")","v":""},{"$f":"IFERROR(INDEX(June!B:B,MATCH(Year!A:A,June!A:A,0)),\"\")","v":""},{"$f":"IFERROR(INDEX(July!B:B,MATCH(Year!A:A,July!A:A,0)),\"\")","v":""},{"$f":"IFERROR(INDEX(Aug!B:B,MATCH(Year!A:A,Aug!A:A,0)),\"\")","v":""},{"$f":"IFERROR(INDEX(Sept!B:B,MATCH(Year!A:A,Sept!A:A,0)),\"\")","v":""},{"$f":"IFERROR(INDEX(Oct!B:B,MATCH(Year!A:A,Oct!A:A,0)),\"\")","v":""},{"$f":"IFERROR(INDEX(Nov!B:B,MATCH(Year!A:A,Nov!A:A,0)),\"\")","v":""},{"$f":"IFERROR(INDEX(Dec!B:B,MATCH(Year!A:A,Dec!A:A,0)),\"\")","v":""},{"$f":"IFERROR(INDEX(Jan!B:B,MATCH(Year!A:A,Jan!A:A,0)),\"\")","v":""},{"$f":"IFERROR(INDEX(Feb!B:B,MATCH(Year!A:A,Feb!A:A,0)),\"\")","v":""},{"$f":"IFERROR(INDEX(March!B:B,MATCH(Year!A:A,March!A:A,0)),\"\")","v":""},"",0]
[{"$f":"IF(ISERROR('Audit questions'!A37),\"\",'Audit questions'!A37)","v":"Test36"},{"$f":"IFERROR(INDEX(April!B:B,MATCH(Year!A:A,April!A:A,0)),\"\")","v":""},{"$f":"IFERROR(INDEX(May!B:B,MATCH(Year!A:A,May!A:A,0)),\"\")","v":""},{"$f":"IFERROR(INDEX(June!B:B,MATCH(Year!A:A,June!A:A,0)),\"\")","v":""},{"$f":"IFERROR(INDEX(July!B:B,MATCH(Year!A:A,July!A:A,0)),\"\")","v":""},{"$f":"IFERROR(INDEX(Aug!B:B,MATCH(Year!A:A,Aug!A:A,0)),\"\")","v":""},{"$f":"IFERROR(INDEX(Sept!B:B,MATCH(Year!A:A,Sept!A:A,0)),\"\")","v":""},{"$f":"IFERROR(INDEX(Oct!B:B,MATCH(Year!A:A,Oct!A:A,0)),\"\")","v":""},{"$f":"IFERROR(INDEX(Nov!B:B,MATCH(Year!A:A,Nov!A:A,0)),\"\")","v":""},{"$f":"IFERROR(INDEX(Dec!B:B,MATCH(Year!A:A,Dec!A:A,0)),\"\")","v":""},{"$f":"IFERROR(INDEX(Jan!B:B,MATCH(Year!A:A,Jan!A:A,0)),\"\")","v":""},{"$f":"IFERROR(INDEX(Feb!B:B,MATCH(Year!A:A,Feb!A:A,0)),\"\")","v":""},{"$f":"IFERROR(INDEX(March!B:B,MATCH(Year!A:A,March!A:A,0)),\"\")","v":""},"",0]
[{"$f":"IF(ISERROR('Audit questions'!A38),\"\",'Audit questions'!A38)","v":"Test37"},{"$f":"IFERROR(INDEX(April!B:B,MATCH(Year!A:A,April!A:A,0)),\"\")","v":""},{"$f":"IFERROR(INDEX(May!B:B,MATCH(Year!A:A,May!A:A,0)),\"\")","v":""},{"$f":"IFERROR(INDEX(June!B:B,MATCH(Year!A:A,June!A:A,0)),\"\")","v":""},{"$f":"IFERROR(INDEX(July!B:B,MATCH(Year!A:A,July!A:A,0)),\"\")","v":""},{"$f":"IFERROR(INDEX(Aug!B:B,MATCH(Year!A:A,Aug!A:A,0)),\"\")","v":""},{"$f":"IFERROR(INDEX(Sept!B:B,MATCH(Year!A:A,Sept!A:A,0)),\"\")","v":""},{"$f":"IFERROR(INDEX(Oct!B:B,MATCH(Year!A:A,Oct!A:A,0)),\"\")","v":""},{"$f":"IFERROR(INDEX(Nov!B:B,MATCH(Year!A:A,Nov!A:A,0)),\"\")","v":""},{"$f":"IFERROR(INDEX(Dec!B:B,MATCH(Year!A:A,Dec!A:A,0)),\"\")","v":""},{"$f":"IFERROR(INDEX(Jan!B:B,MATCH(Year!A:A,Jan!A:A,0)),\"\")","v":""},{"$f":"IFERROR(INDEX(Feb!B:B,MATCH(Year!A:A,Feb!A:A,0)),\"\")","v":""},{"$f":"IFERROR(INDEX(March!B:B,MATCH(Year!A:A,March!A:A,0)),\"\")","v":""},"",0]
[{"$f":"IF(ISERROR('Audit questions'!A39),\"\",'Audit questions'!A39)","v":"Test38"},{"$f":"IFERROR(INDEX(April!B:B,MATCH(Year!A:A,April!A:A,0)),\"\")","v":""},{"$f":"IFERROR(INDEX(May!B:B,MATCH(Year!A:A,May!A:A,0)),\"\")","v":""},{"$f":"IFERROR(INDEX(June!B:B,MATCH(Year!A:A,June!A:A,0)),\"\")","v":""},{"$f":"IFERROR(INDEX(July!B:B,MATCH(Year!A:A,July!A:A,0)),\"\")","v":""},{"$f":"IFERROR(INDEX(Aug!B:B,MATCH(Year!A:A,Aug!A:A,0)),\"\")","v":""},{"$f":"IFERROR(INDEX(Sept!B:B,MATCH(Year!A:A,Sept!A:A,0)),\"\")","v":""},{"$f":"IFERROR(INDEX(Oct!B:B,MATCH(Year!A:A,Oct!A:A,0)),\"\")","v":""},{"$f":"IFERROR(INDEX(Nov!B:B,MATCH(Year!A:A,Nov!A:A,0)),\"\")","v":""},{"$f":"IFERROR(INDEX(Dec!B:B,MATCH(Year!A:A,Dec!A:A,0)),\"\")","v":""},{"$f":"IFERROR(INDEX(Jan!B:B,MATCH(Year!A:A,Jan!A:A,0)),\"\")","v":""},{"$f":"IFERROR(INDEX(Feb!B:B,MATCH(Year!A:A,Feb!A:A,0)),\"\")","v":""},{"$f":"IFERROR(INDEX(March!B:B,MATCH(Year!A:A,March!A:A,0)),\"\")","v":""},"",0]
[{"$f":"IF(ISERROR('Audit questions'!A40),\"\",'Audit questions'!A40)","v":"Test39"},{"$f":"IFERROR(INDEX(April!B:B,MATCH(Year!A:A,April!A:A,0)),\"\")","v":""},{"$f":"IFERROR(INDEX(May!B:B,MATCH(Year!A:A,May!A:A,0)),\"\")","v":""},{"$f":"IFERROR(INDEX(June!B:B,MATCH(Year!A:A,June!A:A,0)),\"\")","v":""},{"$f":"IFERROR(INDEX(July!B:B,MATCH(Year!A:A,July!A:A,0)),\"\")","v":""},{"$f":"IFERROR(INDEX(Aug!B:B,MATCH(Year!A:A,Aug!A:A,0)),\"\")","v":""},{"$f":"IFERROR(INDEX(Sept!B:B,MATCH(Year!A:A,Sept!A:A,0)),\"\")","v":""},{"$f":"IFERROR(INDEX(Oct!B:B,MATCH(Year!A:A,Oct!A:A,0)),\"\")","v":""},{"$f":"IFERROR(INDEX(Nov!B:B,MATCH(Year!A:A,Nov!A:A,0)),\"\")","v":""},{"$f":"IFERROR(INDEX(Dec!B:B,MATCH(Year!A:A,Dec!A:A,0)),\"\")","v":""},{"$f":"IFERROR(INDEX(Jan!B:B,MATCH(Year!A:A,Jan!A:A,0)),\"\")","v":""},{"$f":"IFERROR(INDEX(Feb!B:B,MATCH(Year!A:A,Feb!A:A,0)),\"\")","v":""},{"$f":"IFERROR(INDEX(March!B:B,MATCH(Year!A:A,March!A:A,0)),\"\")","v":""},"",0]
[{"$f":"IF(ISERROR('Audit questions'!A41),\"\",'Audit questions'!A41)","v":"Test40"},{"$f":"IFERROR(INDEX(April!B:B,MATCH(Year!A:A,April!A:A,0)),\"\")","v":""},{"$f":"IFERROR(INDEX(May!B:B,MATCH(Year!A:A,May!A:A,0)),\"\")","v":""},{"$f":"IFERROR(INDEX(June!B:B,MATCH(Year!A:A,June!A:A,0)),\"\")","v":""},{"$f":"IFERROR(INDEX(July!B:B,MATCH(Year!A:A,July!A:A,0)),\"\")","v":""},{"$f":"IFERROR(INDEX(Aug!B:B,MATCH(Year!A:A,Aug!A:A,0)),\"\")","v":""},{"$f":"IFERROR(INDEX(Sept!B:B,MATCH(Year!A:A,Sept!A:A,0)),\"\")","v":""},{"$f":"IFERROR(INDEX(Oct!B:B,MATCH(Year!A:A,Oct!A:A,0)),\"\")","v":""},{"$f":"IFERROR(INDEX(Nov!B:B,MATCH(Year!A:A,Nov!A:A,0)),\"\")","v":""},{"$f":"IFERROR(INDEX(Dec!B:B,MATCH(Year!A:A,Dec!A:A,0)),\"\")","v":""},{"$f":"IFERROR(INDEX(Jan!B:B,MATCH(Year!A:A,Jan!A:A,0)),\"\")","v":""},{"$f":"IFERROR(INDEX(Feb!B:B,MATCH(Year!A:A,Feb!A:A,0)),\"\")","v":""},{"$f":"IFERROR(INDEX(March!B:B,MATCH(Year!A:A,March!A:A,0)),\"\")","v":""},"",0]
["Average",{"$f":"IF(ISERROR((SUM(B14:B53)/April!B8)),\"\",(SUM(B14:B53)/April!B8))","v":""},{"$f":"IF(ISERROR((SUM(C14:C53)/May!B8)),\"\",(SUM(C14:C53)/May!B8))","v":""},{"$f":"IF(ISERROR((SUM(D14:D53)/June!B8)),\"\",(SUM(D14:D53)/June!B8))","v":""},{"$f":"IF(ISERROR((SUM(E14:E53)/July!B8)),\"\",(SUM(E14:E53)/July!B8))","v":""},{"$f":"IF(ISERROR((SUM(F14:F53)/Aug!B8)),\"\",(SUM(F14:F53)/Aug!B8))","v":""},{"$f":"IF(ISERROR((SUM(G14:G53)/Sept!B8)),\"\",(SUM(G14:G53)/Sept!B8))","v":""},{"$f":"IF(ISERROR((SUM(H14:H53)/Oct!B8)),\"\",(SUM(H14:H53)/Oct!B8))","v":""},{"$f":"IF(ISERROR((SUM(I14:I53)/Nov!B8)),\"\",(SUM(I14:I53)/Nov!B8))","v":""},{"$f":"IF(ISERROR((SUM(J14:J53)/Dec!B8)),\"\",(SUM(J14:J53)/Dec!B8))","v":""},{"$f":"IF(ISERROR((SUM(K14:K53)/Jan!B8)),\"\",(SUM(K14:K53)/Jan!B8))","v":""},{"$f":"IF(ISERROR((SUM(L14:L53)/Feb!B8)),\"\",(SUM(L14:L53)/Feb!B8))","v":""},{"$f":"IF(ISERROR((SUM(M14:M53)/March!B8)),\"\",(SUM(M14:M53)/March!B8))","v":""},{"$f":"IF(ISERROR((SUM(B54:M54))/B4),\"\",(SUM(B54:M54))/B4)","v":""}]
[]
["Compliant"]
["Metric","April","May","June","July","August","September","October","November","December","January","February","March","Year average"]
[{"$f":"IF(ISERROR('Audit questions'!A2),\"\",'Audit questions'!A2)","v":"Test1"},{"$f":"IFERROR(INDEX(April!C:C,MATCH(Year!A:A,April!A:A,0)),\"\")","v":""},{"$f":"IFERROR(INDEX(May!C:C,MATCH(Year!A:A,May!A:A,0)),\"\")","v":""},{"$f":"IFERROR(INDEX(June!C:C,MATCH(Year!A:A,June!A:A,0)),\"\")","v":""},{"$f":"IFERROR(INDEX(July!C:C,MATCH(Year!A:A,July!A:A,0)),\"\")","v":""},{"$f":"IFERROR(INDEX(Aug!C:C,MATCH(Year!A:A,Aug!A:A,0)),\"\")","v":""},{"$f":"IFERROR(INDEX(Sept!C:C,MATCH(Year!A:A,Sept!A:A,0)),\"\")","v":""},{"$f":"IFERROR(INDEX(Oct!C:C,MATCH(Year!A:A,Oct!A:A,0)),\"\")","v":""},{"$f":"IFERROR(INDEX(Nov!C:C,MATCH(Year!A:A,Nov!A:A,0)),\"\")","v":""},{"$f":"IFERROR(INDEX(Dec!C:C,MATCH(Year!A:A,Dec!A:A,0)),\"\")","v":""},{"$f":"IFERROR(INDEX(Jan!C:C,MATCH(Year!A:A,Jan!A:A,0)),\"\")","v":""},{"$f":"IFERROR(INDEX(Feb!C:C,MATCH(Year!A:A,Feb!A:A,0)),\"\")","v":""},{"$f":"IFERROR(INDEX(March!C:C,MATCH(Year!A:A,March!A:A,0)),\"\")","v":""},{"$f":"IF(ISERROR((SUM(B58:M58))/O14),\"\",(SUM(B58:M58))/O14)","v":""}]
[{"$f":"IF(ISERROR('Audit questions'!A3),\"\",'Audit questions'!A3)","v":"Test2"},{"$f":"IFERROR(INDEX(April!C:C,MATCH(Year!A:A,April!A:A,0)),\"\")","v":""},{"$f":"IFERROR(INDEX(May!C:C,MATCH(Year!A:A,May!A:A,0)),\"\")","v":""},{"$f":"IFERROR(INDEX(June!C:C,MATCH(Year!A:A,June!A:A,0)),\"\")","v":""},{"$f":"IFERROR(INDEX(July!C:C,MATCH(Year!A:A,July!A:A,0)),\"\")","v":""},{"$f":"IFERROR(INDEX(Aug!C:C,MATCH(Year!A:A,Aug!A:A,0)),\"\")","v":""},{"$f":"IFERROR(INDEX(Sept!C:C,MATCH(Year!A:A,Sept!A:A,0)),\"\")","v":""},{"$f":"IFERROR(INDEX(Oct!C:C,MATCH(Year!A:A,Oct!A:A,0)),\"\")","v":""},{"$f":"IFERROR(INDEX(Nov!C:C,MATCH(Year!A:A,Nov!A:A,0)),\"\")","v":""},{"$f":"IFERROR(INDEX(Dec!C:C,MATCH(Year!A:A,Dec!A:A,0)),\"\")","v":""},{"$f":"IFERROR(INDEX(Jan!C:C,MATCH(Year!A:A,Jan!A:A,0)),\"\")","v":""},{"$f":"IFERROR(INDEX(Feb!C:C,MATCH(Year!A:A,Feb!A:A,0)),\"\")","v":""},{"$f":"IFERROR(INDEX(March!C:C,MATCH(Year!A:A,March!A:A,0)),\"\")","v":""},""]
[{"$f":"IF(ISERROR('Audit questions'!A4),\"\",'Audit questions'!A4)","v":"Test3"},{"$f":"IFERROR(INDEX(April!C:C,MATCH(Year!A:A,April!A:A,0)),\"\")","v":""},{"$f":"IFERROR(INDEX(May!C:C,MATCH(Year!A:A,May!A:A,0)),\"\")","v":""},{"$f":"IFERROR(INDEX(June!C:C,MATCH(Year!A:A,June!A:A,0)),\"\")","v":""},{"$f":"IFERROR(INDEX(July!C:C,MATCH(Year!A:A,July!A:A,0)),\"\")","v":""},{"$f":"IFERROR(INDEX(Aug!C:C,MATCH(Year!A:A,Aug!A:A,0)),\"\")","v":""},{"$f":"IFERROR(INDEX(Sept!C:C,MATCH(Year!A:A,Sept!A:A,0)),\"\")","v":""},{"$f":"IFERROR(INDEX(Oct!C:C,MATCH(Year!A:A,Oct!A:A,0)),\"\")","v":""},{"$f":"IFERROR(INDEX(Nov!C:C,MATCH(Year!A:A,Nov!A:A,0)),\"\")","v":""},{"$f":"IFERROR(INDEX(Dec!C:C,MATCH(Year!A:A,Dec!A:A,0)),\"\")","v":""},{"$f":"IFERROR(INDEX(Jan!C:C,MATCH(Year!A:A,Jan!A:A,0)),\"\")","v":""},{"$f":"IFERROR(INDEX(Feb!C:C,MATCH(Year!A:A,Feb!A:A,0)),\"\")","v":""},{"$f":"IFERROR(INDEX(March!C:C,MATCH(Year!A:A,March!A:A,0)),\"\")","v":""},""]
[{"$f":"IF(ISERROR('Audit questions'!A5),\"\",'Audit questions'!A5)","v":"Test4"},{"$f":"IFERROR(INDEX(April!C:C,MATCH(Year!A:A,April!A:A,0)),\"\")","v":""},{"$f":"IFERROR(INDEX(May!C:C,MATCH(Year!A:A,May!A:A,0)),\"\")","v":""},{"$f":"IFERROR(INDEX(June!C:C,MATCH(Year!A:A,June!A:A,0)),\"\")","v":""},{"$f":"IFERROR(INDEX(July!C:C,MATCH(Year!A:A,July!A:A,0)),\"\")","v":""},{"$f":"IFERROR(INDEX(Aug!C:C,MATCH(Year!A:A,Aug!A:A,0)),\"\")","v":""},{"$f":"IFERROR(INDEX(Sept!C:C,MATCH(Year!A:A,Sept!A:A,0)),\"\")","v":""},{"$f":"IFERROR(INDEX(Oct!C:C,MATCH(Year!A:A,Oct!A:A,0)),\"\")","v":""},{"$f":"IFERROR(INDEX(Nov!C:C,MATCH(Year!A:A,Nov!A:A,0)),\"\")","v":""},{"$f":"IFERROR(INDEX(Dec!C:C,MATCH(Year!A:A,Dec!A:A,0)),\"\")","v":""},{"$f":"IFERROR(INDEX(Jan!C:C,MATCH(Year!A:A,Jan!A:A,0)),\"\")","v":""},{"$f":"IFERROR(INDEX(Feb!C:C,MATCH(Year!A:A,Feb!A:A,0)),\"\")","v":""},{"$f":"IFERROR(INDEX(March!C:C,MATCH(Year!A:A,March!A:A,0)),\"\")","v":""},""]
[{"$f":"IF(ISERROR('Audit questions'!A6),\"\",'Audit questions'!A6)","v":"Test5"},{"$f":"IFERROR(INDEX(April!C:C,MATCH(Year!A:A,April!A:A,0)),\"\")","v":""},{"$f":"IFERROR(INDEX(May!C:C,MATCH(Year!A:A,May!A:A,0)),\"\")","v":""},{"$f":"IFERROR(INDEX(June!C:C,MATCH(Year!A:A,June!A:A,0)),\"\")","v":""},{"$f":"IFERROR(INDEX(July!C:C,MATCH(Year!A:A,July!A:A,0)),\"\")","v":""},{"$f":"IFERROR(INDEX(Aug!C:C,MATCH(Year!A:A,Aug!A:A,0)),\"\")","v":""},{"$f":"IFERROR(INDEX(Sept!C:C,MATCH(Year!A:A,Sept!A:A,0)),\"\")","v":""},{"$f":"IFERROR(INDEX(Oct!C:C,MATCH(Year!A:A,Oct!A:A,0)),\"\")","v":""},{"$f":"IFERROR(INDEX(Nov!C:C,MATCH(Year!A:A,Nov!A:A,0)),\"\")","v":""},{"$f":"IFERROR(INDEX(Dec!C:C,MATCH(Year!A:A,Dec!A:A,0)),\"\")","v":""},{"$f":"IFERROR(INDEX(Jan!C:C,MATCH(Year!A:A,Jan!A:A,0)),\"\")","v":""},{"$f":"IFERROR(INDEX(Feb!C:C,MATCH(Year!A:A,Feb!A:A,0)),\"\")","v":""},{"$f":"IFERROR(INDEX(March!C:C,MATCH(Year!A:A,March!A:A,0)),\"\")","v":""},""]
[{"$f":"IF(ISERROR('Audit questions'!A7),\"\",'Audit questions'!A7)","v":"Test6"},{"$f":"IFERROR(INDEX(April!C:C,MATCH(Year!A:A,April!A:A,0)),\"\")","v":""},{"$f":"IFERROR(INDEX(May!C:C,MATCH(Year!A:A,May!A:A,0)),\"\")","v":""},{"$f":"IFERROR(INDEX(June!C:C,MATCH(Year!A:A,June!A:A,0)),\"\")","v":""},{"$f":"IFERROR(INDEX(July!C:C,MATCH(Year!A:A,July!A:A,0)),\"\")","v":""},{"$f":"IFERROR(INDEX(Aug!C:C,MATCH(Year!A:A,Aug!A:A,0)),\"\")","v":""},{"$f":"IFERROR(INDEX(Sept!C:C,MATCH(Year!A:A,Sept!A:A,0)),\"\")","v":""},{"$f":"IFERROR(INDEX(Oct!C:C,MATCH(Year!A:A,Oct!A:A,0)),\"\")","v":""},{"$f":"IFERROR(INDEX(Nov!C:C,MATCH(Year!A:A,Nov!A:A,0)),\"\")","v":""},{"$f":"IFERROR(INDEX(Dec!C:C,MATCH(Year!A:A,Dec!A:A,0)),\"\")","v":""},{"$f":"IFERROR(INDEX(Jan!C:C,MATCH(Year!A:A,Jan!A:A,0)),\"\")","v":""},{"$f":"IFERROR(INDEX(Feb!C:C,MATCH(Year!A:A,Feb!A:A,0)),\"\")","v":""},{"$f":"IFERROR(INDEX(March!C:C,MATCH(Year!A:A,March!A:A,0)),\"\")","v":""},""]
[{"$f":"IF(ISERROR('Audit questions'!A8),\"\",'Audit questions'!A8)","v":"Test7"},{"$f":"IFERROR(INDEX(April!C:C,MATCH(Year!A:A,April!A:A,0)),\"\")","v":""},{"$f":"IFERROR(INDEX(May!C:C,MATCH(Year!A:A,May!A:A,0)),\"\")","v":""},{"$f":"IFERROR(INDEX(June!C:C,MATCH(Year!A:A,June!A:A,0)),\"\")","v":""},{"$f":"IFERROR(INDEX(July!C:C,MATCH(Year!A:A,July!A:A,0)),\"\")","v":""},{"$f":"IFERROR(INDEX(Aug!C:C,MATCH(Year!A:A,Aug!A:A,0)),\"\")","v":""},{"$f":"IFERROR(INDEX(Sept!C:C,MATCH(Year!A:A,Sept!A:A,0)),\"\")","v":""},{"$f":"IFERROR(INDEX(Oct!C:C,MATCH(Year!A:A,Oct!A:A,0)),\"\")","v":""},{"$f":"IFERROR(INDEX(Nov!C:C,MATCH(Year!A:A,Nov!A:A,0)),\"\")","v":""},{"$f":"IFERROR(INDEX(Dec!C:C,MATCH(Year!A:A,Dec!A:A,0)),\"\")","v":""},{"$f":"IFERROR(INDEX(Jan!C:C,MATCH(Year!A:A,Jan!A:A,0)),\"\")","v":""},{"$f":"IFERROR(INDEX(Feb!C:C,MATCH(Year!A:A,Feb!A:A,0)),\"\")","v":""},{"$f":"IFERROR(INDEX(March!C:C,MATCH(Year!A:A,March!A:A,0)),\"\")","v":""},""]
[{"$f":"IF(ISERROR('Audit questions'!A9),\"\",'Audit questions'!A9)","v":"Test8"},{"$f":"IFERROR(INDEX(April!C:C,MATCH(Year!A:A,April!A:A,0)),\"\")","v":""},{"$f":"IFERROR(INDEX(May!C:C,MATCH(Year!A:A,May!A:A,0)),\"\")","v":""},{"$f":"IFERROR(INDEX(June!C:C,MATCH(Year!A:A,June!A:A,0)),\"\")","v":""},{"$f":"IFERROR(INDEX(July!C:C,MATCH(Year!A:A,July!A:A,0)),\"\")","v":""},{"$f":"IFERROR(INDEX(Aug!C:C,MATCH(Year!A:A,Aug!A:A,0)),\"\")","v":""},{"$f":"IFERROR(INDEX(Sept!C:C,MATCH(Year!A:A,Sept!A:A,0)),\"\")","v":""},{"$f":"IFERROR(INDEX(Oct!C:C,MATCH(Year!A:A,Oct!A:A,0)),\"\")","v":""},{"$f":"IFERROR(INDEX(Nov!C:C,MATCH(Year!A:A,Nov!A:A,0)),\"\")","v":""},{"$f":"IFERROR(INDEX(Dec!C:C,MATCH(Year!A:A,Dec!A:A,0)),\"\")","v":""},{"$f":"IFERROR(INDEX(Jan!C:C,MATCH(Year!A:A,Jan!A:A,0)),\"\")","v":""},{"$f":"IFERROR(INDEX(Feb!C:C,MATCH(Year!A:A,Feb!A:A,0)),\"\")","v":""},{"$f":"IFERROR(INDEX(March!C:C,MATCH(Year!A:A,March!A:A,0)),\"\")","v":""},""]
[{"$f":"IF(ISERROR('Audit questions'!A10),\"\",'Audit questions'!A10)","v":"Test9"},{"$f":"IFERROR(INDEX(April!C:C,MATCH(Year!A:A,April!A:A,0)),\"\")","v":""},{"$f":"IFERROR(INDEX(May!C:C,MATCH(Year!A:A,May!A:A,0)),\"\")","v":""},{"$f":"IFERROR(INDEX(June!C:C,MATCH(Year!A:A,June!A:A,0)),\"\")","v":""},{"$f":"IFERROR(INDEX(July!C:C,MATCH(Year!A:A,July!A:A,0)),\"\")","v":""},{"$f":"IFERROR(INDEX(Aug!C:C,MATCH(Year!A:A,Aug!A:A,0)),\"\")","v":""},{"$f":"IFERROR(INDEX(Sept!C:C,MATCH(Year!A:A,Sept!A:A,0)),\"\")","v":""},{"$f":"IFERROR(INDEX(Oct!C:C,MATCH(Year!A:A,Oct!A:A,0)),\"\")","v":""},{"$f":"IFERROR(INDEX(Nov!C:C,MATCH(Year!A:A,Nov!A:A,0)),\"\")","v":""},{"$f":"IFERROR(INDEX(Dec!C:C,MATCH(Year!A:A,Dec!A:A,0)),\"\")","v":""},{"$f":"IFERROR(INDEX(Jan!C:C,MATCH(Year!A:A,Jan!A:A,0)),\"\")","v":""},{"$f":"IFERROR(INDEX(Feb!C:C,MATCH(Year!A:A,Feb!A:A,0)),\"\")","v":""},{"$f":"IFERROR(INDEX(March!C:C,MATCH(Year!A:A,March!A:A,0)),\"\")","v":""},""]
[{"$f":"IF(ISERROR('Audit questions'!A11),\"\",'Audit questions'!A11)","v":"Test10"},{"$f":"IFERROR(INDEX(April!C:C,MATCH(Year!A:A,April!A:A,0)),\"\")","v":""},{"$f":"IFERROR(INDEX(May!C:C,MATCH(Year!A:A,May!A:A,0)),\"\")","v":""},{"$f":"IFERROR(INDEX(June!C:C,MATCH(Year!A:A,June!A:A,0)),\"\")","v":""},{"$f":"IFERROR(INDEX(July!C:C,MATCH(Year!A:A,July!A:A,0)),\"\")","v":""},{"$f":"IFERROR(INDEX(Aug!C:C,MATCH(Year!A:A,Aug!A:A,0)),\"\")","v":""},{"$f":"IFERROR(INDEX(Sept!C:C,MATCH(Year!A:A,Sept!A:A,0)),\"\")","v":""},{"$f":"IFERROR(INDEX(Oct!C:C,MATCH(Year!A:A,Oct!A:A,0)),\"\")","v":""},{"$f":"IFERROR(INDEX(Nov!C:C,MATCH(Year!A:A,Nov!A:A,0)),\"\")","v":""},{"$f":"IFERROR(INDEX(Dec!C:C,MATCH(Year!A:A,Dec!A:A,0)),\"\")","v":""},{"$f":"IFERROR(INDEX(Jan!C:C,MATCH(Year!A:A,Jan!A:A,0)),\"\")","v":""},{"$f":"IFERROR(INDEX(Feb!C:C,MATCH(Year!A:A,Feb!A:A,0)),\"\")","v":""},{"$f":"IFERROR(INDEX(March!C:C,MATCH(Year!A:A,March!A:A,0)),\"\")","v":""},""]
[{"$f":"IF(ISERROR('Audit questions'!A12),\"\",'Audit questions'!A12)","v":"Test11"},{"$f":"IFERROR(INDEX(April!C:C,MATCH(Year!A:A,April!A:A,0)),\"\")","v":""},{"$f":"IFERROR(INDEX(May!C:C,MATCH(Year!A:A,May!A:A,0)),\"\")","v":""},{"$f":"IFERROR(INDEX(June!C:C,MATCH(Year!A:A,June!A:A,0)),\"\")","v":""},{"$f":"IFERROR(INDEX(July!C:C,MATCH(Year!A:A,July!A:A,0)),\"\")","v":""},{"$f":"IFERROR(INDEX(Aug!C:C,MATCH(Year!A:A,Aug!A:A,0)),\"\")","v":""},{"$f":"IFERROR(INDEX(Sept!C:C,MATCH(Year!A:A,Sept!A:A,0)),\"\")","v":""},{"$f":"IFERROR(INDEX(Oct!C:C,MATCH(Year!A:A,Oct!A:A,0)),\"\")","v":""},{"$f":"IFERROR(INDEX(Nov!C:C,MATCH(Year!A:A,Nov!A:A,0)),\"\")","v":""},{"$f":"IFERROR(INDEX(Dec!C:C,MATCH(Year!A:A,Dec!A:A,0)),\"\")","v":""},{"$f":"IFERROR(INDEX(Jan!C:C,MATCH(Year!A:A,Jan!A:A,0)),\"\")","v":""},{"$f":"IFERROR(INDEX(Feb!C:C,MATCH(Year!A:A,Feb!A:A,0)),\"\")","v":""},{"$f":"IFERROR(INDEX(March!C:C,MATCH(Year!A:A,March!A:A,0)),\"\")","v":""},""]
[{"$f":"IF(ISERROR('Audit questions'!A13),\"\",'Audit questions'!A13)","v":"Test12"},{"$f":"IFERROR(INDEX(April!C:C,MATCH(Year!A:A,April!A:A,0)),\"\")","v":""},{"$f":"IFERROR(INDEX(May!C:C,MATCH(Year!A:A,May!A:A,0)),\"\")","v":""},{"$f":"IFERROR(INDEX(June!C:C,MATCH(Year!A:A,June!A:A,0)),\"\")","v":""},{"$f":"IFERROR(INDEX(July!C:C,MATCH(Year!A:A,July!A:A,0)),\"\")","v":""},{"$f":"IFERROR(INDEX(Aug!C:C,MATCH(Year!A:A,Aug!A:A,0)),\"\")","v":""},{"$f":"IFERROR(INDEX(Sept!C:C,MATCH(Year!A:A,Sept!A:A,0)),\"\")","v":""},{"$f":"IFERROR(INDEX(Oct!C:C,MATCH(Year!A:A,Oct!A:A,0)),\"\")","v":""},{"$f":"IFERROR(INDEX(Nov!C:C,MATCH(Year!A:A,Nov!A:A,0)),\"\")","v":""},{"$f":"IFERROR(INDEX(Dec!C:C,MATCH(Year!A:A,Dec!A:A,0)),\"\")","v":""},{"$f":"IFERROR(INDEX(Jan!C:C,MATCH(Year!A:A,Jan!A:A,0)),\"\")","v":""},{"$f":"IFERROR(INDEX(Feb!C:C,MATCH(Year!A:A,Feb!A:A,0)),\"\")","v":""},{"$f":"IFERROR(INDEX(March!C:C,MATCH(Year!A:A,March!A:A,0)),\"\")","v":""},""]
[{"$f":"IF(ISERROR('Audit questions'!A14),\"\",'Audit questions'!A14)","v":"Test13"},{"$f":"IFERROR(INDEX(April!C:C,MATCH(Year!A:A,April!A:A,0)),\"\")","v":""},{"$f":"IFERROR(INDEX(May!C:C,MATCH(Year!A:A,May!A:A,0)),\"\")","v":""},{"$f":"IFERROR(INDEX(June!C:C,MATCH(Year!A:A,June!A:A,0)),\"\")","v":""},{"$f":"IFERROR(INDEX(July!C:C,MATCH(Year!A:A,July!A:A,0)),\"\")","v":""},{"$f":"IFERROR(INDEX(Aug!C:C,MATCH(Year!A:A,Aug!A:A,0)),\"\")","v":""},{"$f":"IFERROR(INDEX(Sept!C:C,MATCH(Year!A:A,Sept!A:A,0)),\"\")","v":""},{"$f":"IFERROR(INDEX(Oct!C:C,MATCH(Year!A:A,Oct!A:A,0)),\"\")","v":""},{"$f":"IFERROR(INDEX(Nov!C:C,MATCH(Year!A:A,Nov!A:A,0)),\"\")","v":""},{"$f":"IFERROR(INDEX(Dec!C:C,MATCH(Year!A:A,Dec!A:A,0)),\"\")","v":""},{"$f":"IFERROR(INDEX(Jan!C:C,MATCH(Year!A:A,Jan!A:A,0)),\"\")","v":""},{"$f":"IFERROR(INDEX(Feb!C:C,MATCH(Year!A:A,Feb!A:A,0)),\"\")","v":""},{"$f":"IFERROR(INDEX(March!C:C,MATCH(Year!A:A,March!A:A,0)),\"\")","v":""},""]
[{"$f":"IF(ISERROR('Audit questions'!A15),\"\",'Audit questions'!A15)","v":"Test14"},{"$f":"IFERROR(INDEX(April!C:C,MATCH(Year!A:A,April!A:A,0)),\"\")","v":""},{"$f":"IFERROR(INDEX(May!C:C,MATCH(Year!A:A,May!A:A,0)),\"\")","v":""},{"$f":"IFERROR(INDEX(June!C:C,MATCH(Year!A:A,June!A:A,0)),\"\")","v":""},{"$f":"IFERROR(INDEX(July!C:C,MATCH(Year!A:A,July!A:A,0)),\"\")","v":""},{"$f":"IFERROR(INDEX(Aug!C:C,MATCH(Year!A:A,Aug!A:A,0)),\"\")","v":""},{"$f":"IFERROR(INDEX(Sept!C:C,MATCH(Year!A:A,Sept!A:A,0)),\"\")","v":""},{"$f":"IFERROR(INDEX(Oct!C:C,MATCH(Year!A:A,Oct!A:A,0)),\"\")","v":""},{"$f":"IFERROR(INDEX(Nov!C:C,MATCH(Year!A:A,Nov!A:A,0)),\"\")","v":""},{"$f":"IFERROR(INDEX(Dec!C:C,MATCH(Year!A:A,Dec!A:A,0)),\"\")","v":""},{"$f":"IFERROR(INDEX(Jan!C:C,MATCH(Year!A:A,Jan!A:A,0)),\"\")","v":""},{"$f":"IFERROR(INDEX(Feb!C:C,MATCH(Year!A:A,Feb!A:A,0)),\"\")","v":""},{"$f":"IFERROR(INDEX(March!C:C,MATCH(Year!A:A,March!A:A,0)),\"\")","v":""},""]
[{"$f":"IF(ISERROR('Audit questions'!A16),\"\",'Audit questions'!A16)","v":"Test15"},{"$f":"IFERROR(INDEX(April!C:C,MATCH(Year!A:A,April!A:A,0)),\"\")","v":""},{"$f":"IFERROR(INDEX(May!C:C,MATCH(Year!A:A,May!A:A,0)),\"\")","v":""},{"$f":"IFERROR(INDEX(June!C:C,MATCH(Year!A:A,June!A:A,0)),\"\")","v":""},{"$f":"IFERROR(INDEX(July!C:C,MATCH(Year!A:A,July!A:A,0)),\"\")","v":""},{"$f":"IFERROR(INDEX(Aug!C:C,MATCH(Year!A:A,Aug!A:A,0)),\"\")","v":""},{"$f":"IFERROR(INDEX(Sept!C:C,MATCH(Year!A:A,Sept!A:A,0)),\"\")","v":""},{"$f":"IFERROR(INDEX(Oct!C:C,MATCH(Year!A:A,Oct!A:A,0)),\"\")","v":""},{"$f":"IFERROR(INDEX(Nov!C:C,MATCH(Year!A:A,Nov!A:A,0)),\"\")","v":""},{"$f":"IFERROR(INDEX(Dec!C:C,MATCH(Year!A:A,Dec!A:A,0)),\"\")","v":""},{"$f":"IFERROR(INDEX(Jan!C:C,MATCH(Year!A:A,Jan!A:A,0)),\"\")","v":""},{"$f":"IFERROR(INDEX(Feb!C:C,MATCH(Year!A:A,Feb!A:A,0)),\"\")","v":""},{"$f":"IFERROR(INDEX(March!C:C,MATCH(Year!A:A,March!A:A,0)),\"\")","v":""},""]
[{"$f":"IF(ISERROR('Audit questions'!A17),\"\",'Audit questions'!A17)","v":"Test16"},{"$f":"IFERROR(INDEX(April!C:C,MATCH(Year!A:A,April!A:A,0)),\"\")","v":""},{"$f":"IFERROR(INDEX(May!C:C,MATCH(Year!A:A,May!A:A,0)),\"\")","v":""},{"$f":"IFERROR(INDEX(June!C:C,MATCH(Year!A:A,June!A:A,0)),\"\")","v":""},{"$f":"IFERROR(INDEX(July!C:C,MATCH(Year!A:A,July!A:A,0)),\"\")","v":""},{"$f":"IFERROR(INDEX(Aug!C:C,MATCH(Year!A:A,Aug!A:A,0)),\"\")","v":""},{"$f":"IFERROR(INDEX(Sept!C:C,MATCH(Year!A:A,Sept!A:A,0)),\"\")","v":""},{"$f":"IFERROR(INDEX(Oct!C:C,MATCH(Year!A:A,Oct!A:A,0)),\"\")","v":""},{"$f":"IFERROR(INDEX(Nov!C:C,MATCH(Year!A:A,Nov!A:A,0)),\"\")","v":""},{"$f":"IFERROR(INDEX(Dec!C:C,MATCH(Year!A:A,Dec!A:A,0)),\"\")","v":""},{"$f":"IFERROR(INDEX(Jan!C:C,MATCH(Year!A:A,Jan!A:A,0)),\"\")","v":""},{"$f":"IFERROR(INDEX(Feb!C:C,MATCH(Year!A:A,Feb!A:A,0)),\"\")","v":""},{"$f":"IFERROR(INDEX(March!C:C,MATCH(Year!A:A,March!A:A,0)),\"\")","v":""},""]
[{"$f":"IF(ISERROR('Audit questions'!A18),\"\",'Audit questions'!A18)","v":"Test17"},{"$f":"IFERROR(INDEX(April!C:C,MATCH(Year!A:A,April!A:A,0)),\"\")","v":""},{"$f":"IFERROR(INDEX(May!C:C,MATCH(Year!A:A,May!A:A,0)),\"\")","v":""},{"$f":"IFERROR(INDEX(June!C:C,MATCH(Year!A:A,June!A:A,0)),\"\")","v":""},{"$f":"IFERROR(INDEX(July!C:C,MATCH(Year!A:A,July!A:A,0)),\"\")","v":""},{"$f":"IFERROR(INDEX(Aug!C:C,MATCH(Year!A:A,Aug!A:A,0)),\"\")","v":""},{"$f":"IFERROR(INDEX(Sept!C:C,MATCH(Year!A:A,Sept!A:A,0)),\"\")","v":""},{"$f":"IFERROR(INDEX(Oct!C:C,MATCH(Year!A:A,Oct!A:A,0)),\"\")","v":""},{"$f":"IFERROR(INDEX(Nov!C:C,MATCH(Year!A:A,Nov!A:A,0)),\"\")","v":""},{"$f":"IFERROR(INDEX(Dec!C:C,MATCH(Year!A:A,Dec!A:A,0)),\"\")","v":""},{"$f":"IFERROR(INDEX(Jan!C:C,MATCH(Year!A:A,Jan!A:A,0)),\"\")","v":""},{"$f":"IFERROR(INDEX(Feb!C:C,MATCH(Year!A:A,Feb!A:A,0)),\"\")","v":""},{"$f":"IFERROR(INDEX(March!C:C,MATCH(Year!A:A,March!A:A,0)),\"\")","v":""},""]
[{"$f":"IF(ISERROR('Audit questions'!A19),\"\",'Audit questions'!A19)","v":"Test18"},{"$f":"IFERROR(INDEX(April!C:C,MATCH(Year!A:A,April!A:A,0)),\"\")","v":""},{"$f":"IFERROR(INDEX(May!C:C,MATCH(Year!A:A,May!A:A,0)),\"\")","v":""},{"$f":"IFERROR(INDEX(June!C:C,MATCH(Year!A:A,June!A:A,0)),\"\")","v":""},{"$f":"IFERROR(INDEX(July!C:C,MATCH(Year!A:A,July!A:A,0)),\"\")","v":""},{"$f":"IFERROR(INDEX(Aug!C:C,MATCH(Year!A:A,Aug!A:A,0)),\"\")","v":""},{"$f":"IFERROR(INDEX(Sept!C:C,MATCH(Year!A:A,Sept!A:A,0)),\"\")","v":""},{"$f":"IFERROR(INDEX(Oct!C:C,MATCH(Year!A:A,Oct!A:A,0)),\"\")","v":""},{"$f":"IFERROR(INDEX(Nov!C:C,MATCH(Year!A:A,Nov!A:A,0)),\"\")","v":""},{"$f":"IFERROR(INDEX(Dec!C:C,MATCH(Year!A:A,Dec!A:A,0)),\"\")","v":""},{"$f":"IFERROR(INDEX(Jan!C:C,MATCH(Year!A:A,Jan!A:A,0)),\"\")","v":""},{"$f":"IFERROR(INDEX(Feb!C:C,MATCH(Year!A:A,Feb!A:A,0)),\"\")","v":""},{"$f":"IFERROR(INDEX(March!C:C,MATCH(Year!A:A,March!A:A,0)),\"\")","v":""},""]
[{"$f":"IF(ISERROR('Audit questions'!A20),\"\",'Audit questions'!A20)","v":"Test19"},{"$f":"IFERROR(INDEX(April!C:C,MATCH(Year!A:A,April!A:A,0)),\"\")","v":""},{"$f":"IFERROR(INDEX(May!C:C,MATCH(Year!A:A,May!A:A,0)),\"\")","v":""},{"$f":"IFERROR(INDEX(June!C:C,MATCH(Year!A:A,June!A:A,0)),\"\")","v":""},{"$f":"IFERROR(INDEX(July!C:C,MATCH(Year!A:A,July!A:A,0)),\"\")","v":""},{"$f":"IFERROR(INDEX(Aug!C:C,MATCH(Year!A:A,Aug!A:A,0)),\"\")","v":""},{"$f":"IFERROR(INDEX(Sept!C:C,MATCH(Year!A:A,Sept!A:A,0)),\"\")","v":""},{"$f":"IFERROR(INDEX(Oct!C:C,MATCH(Year!A:A,Oct!A:A,0)),\"\")","v":""},{"$f":"IFERROR(INDEX(Nov!C:C,MATCH(Year!A:A,Nov!A:A,0)),\"\")","v":""},{"$f":"IFERROR(INDEX(Dec!C:C,MATCH(Year!A:A,Dec!A:A,0)),\"\")","v":""},{"$f":"IFERROR(INDEX(Jan!C:C,MATCH(Year!A:A,Jan!A:A,0)),\"\")","v":""},{"$f":"IFERROR(INDEX(Feb!C:C,MATCH(Year!A:A,Feb!A:A,0)),\"\")","v":""},{"$f":"IFERROR(INDEX(March!C:C,MATCH(Year!A:A,March!A:A,0)),\"\")","v":""},""]
[{"$f":"IF(ISERROR('Audit questions'!A21),\"\",'Audit questions'!A21)","v":"Test20"},{"$f":"IFERROR(INDEX(April!C:C,MATCH(Year!A:A,April!A:A,0)),\"\")","v":""},{"$f":"IFERROR(INDEX(May!C:C,MATCH(Year!A:A,May!A:A,0)),\"\")","v":""},{"$f":"IFERROR(INDEX(June!C:C,MATCH(Year!A:A,June!A:A,0)),\"\")","v":""},{"$f":"IFERROR(INDEX(July!C:C,MATCH(Year!A:A,July!A:A,0)),\"\")","v":""},{"$f":"IFERROR(INDEX(Aug!C:C,MATCH(Year!A:A,Aug!A:A,0)),\"\")","v":""},{"$f":"IFERROR(INDEX(Sept!C:C,MATCH(Year!A:A,Sept!A:A,0)),\"\")","v":""},{"$f":"IFERROR(INDEX(Oct!C:C,MATCH(Year!A:A,Oct!A:A,0)),\"\")","v":""},{"$f":"IFERROR(INDEX(Nov!C:C,MATCH(Year!A:A,Nov!A:A,0)),\"\")","v":""},{"$f":"IFERROR(INDEX(Dec!C:C,MATCH(Year!A:A,Dec!A:A,0)),\"\")","v":""},{"$f":"IFERROR(INDEX(Jan!C:C,MATCH(Year!A:A,Jan!A:A,0)),\"\")","v":""},{"$f":"IFERROR(INDEX(Feb!C:C,MATCH(Year!A:A,Feb!A:A,0)),\"\")","v":""},{"$f":"IFERROR(INDEX(March!C:C,MATCH(Year!A:A,March!A:A,0)),\"\")","v":""},""]
[{"$f":"IF(ISERROR('Audit questions'!A22),\"\",'Audit questions'!A22)","v":"Test21"},{"$f":"IFERROR(INDEX(April!C:C,MATCH(Year!A:A,April!A:A,0)),\"\")","v":""},{"$f":"IFERROR(INDEX(May!C:C,MATCH(Year!A:A,May!A:A,0)),\"\")","v":""},{"$f":"IFERROR(INDEX(June!C:C,MATCH(Year!A:A,June!A:A,0)),\"\")","v":""},{"$f":"IFERROR(INDEX(July!C:C,MATCH(Year!A:A,July!A:A,0)),\"\")","v":""},{"$f":"IFERROR(INDEX(Aug!C:C,MATCH(Year!A:A,Aug!A:A,0)),\"\")","v":""},{"$f":"IFERROR(INDEX(Sept!C:C,MATCH(Year!A:A,Sept!A:A,0)),\"\")","v":""},{"$f":"IFERROR(INDEX(Oct!C:C,MATCH(Year!A:A,Oct!A:A,0)),\"\")","v":""},{"$f":"IFERROR(INDEX(Nov!C:C,MATCH(Year!A:A,Nov!A:A,0)),\"\")","v":""},{"$f":"IFERROR(INDEX(Dec!C:C,MATCH(Year!A:A,Dec!A:A,0)),\"\")","v":""},{"$f":"IFERROR(INDEX(Jan!C:C,MATCH(Year!A:A,Jan!A:A,0)),\"\")","v":""},{"$f":"IFERROR(INDEX(Feb!C:C,MATCH(Year!A:A,Feb!A:A,0)),\"\")","v":""},{"$f":"IFERROR(INDEX(March!C:C,MATCH(Year!A:A,March!A:A,0)),\"\")","v":""},""]
[{"$f":"IF(ISERROR('Audit questions'!A23),\"\",'Audit questions'!A23)","v":"Test22"},{"$f":"IFERROR(INDEX(April!C:C,MATCH(Year!A:A,April!A:A,0)),\"\")","v":""},{"$f":"IFERROR(INDEX(May!C:C,MATCH(Year!A:A,May!A:A,0)),\"\")","v":""},{"$f":"IFERROR(INDEX(June!C:C,MATCH(Year!A:A,June!A:A,0)),\"\")","v":""},{"$f":"IFERROR(INDEX(July!C:C,MATCH(Year!A:A,July!A:A,0)),\"\")","v":""},{"$f":"IFERROR(INDEX(Aug!C:C,MATCH(Year!A:A,Aug!A:A,0)),\"\")","v":""},{"$f":"IFERROR(INDEX(Sept!C:C,MATCH(Year!A:A,Sept!A:A,0)),\"\")","v":""},{"$f":"IFERROR(INDEX(Oct!C:C,MATCH(Year!A:A,Oct!A:A,0)),\"\")","v":""},{"$f":"IFERROR(INDEX(Nov!C:C,MATCH(Year!A:A,Nov!A:A,0)),\"\")","v":""},{"$f":"IFERROR(INDEX(Dec!C:C,MATCH(Year!A:A,Dec!A:A,0)),\"\")","v":""},{"$f":"IFERROR(INDEX(Jan!C:C,MATCH(Year!A:A,Jan!A:A,0)),\"\")","v":""},{"$f":"IFERROR(INDEX(Feb!C:C,MATCH(Year!A:A,Feb!A:A,0)),\"\")","v":""},{"$f":"IFERROR(INDEX(March!C:C,MATCH(Year!A:A,March!A:A,0)),\"\")","v":""},""]
[{"$f":"IF(ISERROR('Audit questions'!A24),\"\",'Audit questions'!A24)","v":"Test23"},{"$f":"IFERROR(INDEX(April!C:C,MATCH(Year!A:A,April!A:A,0)),\"\")","v":""},{"$f":"IFERROR(INDEX(May!C:C,MATCH(Year!A:A,May!A:A,0)),\"\")","v":""},{"$f":"IFERROR(INDEX(June!C:C,MATCH(Year!A:A,June!A:A,0)),\"\")","v":""},{"$f":"IFERROR(INDEX(July!C:C,MATCH(Year!A:A,July!A:A,0)),\"\")","v":""},{"$f":"IFERROR(INDEX(Aug!C:C,MATCH(Year!A:A,Aug!A:A,0)),\"\")","v":""},{"$f":"IFERROR(INDEX(Sept!C:C,MATCH(Year!A:A,Sept!A:A,0)),\"\")","v":""},{"$f":"IFERROR(INDEX(Oct!C:C,MATCH(Year!A:A,Oct!A:A,0)),\"\")","v":""},{"$f":"IFERROR(INDEX(Nov!C:C,MATCH(Year!A:A,Nov!A:A,0)),\"\")","v":""},{"$f":"IFERROR(INDEX(Dec!C:C,MATCH(Year!A:A,Dec!A:A,0)),\"\")","v":""},{"$f":"IFERROR(INDEX(Jan!C:C,MATCH(Year!A:A,Jan!A:A,0)),\"\")","v":""},{"$f":"IFERROR(INDEX(Feb!C:C,MATCH(Year!A:A,Feb!A:A,0)),\"\")","v":""},{"$f":"IFERROR(INDEX(March!C:C,MATCH(Year!A:A,March!A:A,0)),\"\")","v":""},""]
[{"$f":"IF(ISERROR('Audit questions'!A25),\"\",'Audit questions'!A25)","v":"Test24"},{"$f":"IFERROR(INDEX(April!C:C,MATCH(Year!A:A,April!A:A,0)),\"\")","v":""},{"$f":"IFERROR(INDEX(May!C:C,MATCH(Year!A:A,May!A:A,0)),\"\")","v":""},{"$f":"IFERROR(INDEX(June!C:C,MATCH(Year!A:A,June!A:A,0)),\"\")","v":""},{"$f":"IFERROR(INDEX(July!C:C,MATCH(Year!A:A,July!A:A,0)),\"\")","v":""},{"$f":"IFERROR(INDEX(Aug!C:C,MATCH(Year!A:A,Aug!A:A,0)),\"\")","v":""},{"$f":"IFERROR(INDEX(Sept!C:C,MATCH(Year!A:A,Sept!A:A,0)),\"\")","v":""},{"$f":"IFERROR(INDEX(Oct!C:C,MATCH(Year!A:A,Oct!A:A,0)),\"\")","v":""},{"$f":"IFERROR(INDEX(Nov!C:C,MATCH(Year!A:A,Nov!A:A,0)),\"\")","v":""},{"$f":"IFERROR(INDEX(Dec!C:C,MATCH(Year!A:A,Dec!A:A,0)),\"\")","v":""},{"$f":"IFERROR(INDEX(Jan!C:C,MATCH(Year!A:A,Jan!A:A,0)),\"\")","v":""},{"$f":"IFERROR(INDEX(Feb!C:C,MATCH(Year!A:A,Feb!A:A,0)),\"\")","v":""},{"$f":"IFERROR(INDEX(March!C:C,MATCH(Year!A:A,March!A:A,0)),\"\")","v":""},""]
[{"$f":"IF(ISERROR('Audit questions'!A26),\"\",'Audit questions'!A26)","v":"Test25"},{"$f":"IFERROR(INDEX(April!C:C,MATCH(Year!A:A,April!A:A,0)),\"\")","v":""},{"$f":"IFERROR(INDEX(May!C:C,MATCH(Year!A:A,May!A:A,0)),\"\")","v":""},{"$f":"IFERROR(INDEX(June!C:C,MATCH(Year!A:A,June!A:A,0)),\"\")","v":""},{"$f":"IFERROR(INDEX(July!C:C,MATCH(Year!A:A,July!A:A,0)),\"\")","v":""},{"$f":"IFERROR(INDEX(Aug!C:C,MATCH(Year!A:A,Aug!A:A,0)),\"\")","v":""},{"$f":"IFERROR(INDEX(Sept!C:C,MATCH(Year!A:A,Sept!A:A,0)),\"\")","v":""},{"$f":"IFERROR(INDEX(Oct!C:C,MATCH(Year!A:A,Oct!A:A,0)),\"\")","v":""},{"$f":"IFERROR(INDEX(Nov!C:C,MATCH(Year!A:A,Nov!A:A,0)),\"\")","v":""},{"$f":"IFERROR(INDEX(Dec!C:C,MATCH(Year!A:A,Dec!A:A,0)),\"\")","v":""},{"$f":"IFERROR(INDEX(Jan!C:C,MATCH(Year!A:A,Jan!A:A,0)),\"\")","v":""},{"$f":"IFERROR(INDEX(Feb!C:C,MATCH(Year!A:A,Feb!A:A,0)),\"\")","v":""},{"$f":"IFERROR(INDEX(March!C:C,MATCH(Year!A:A,March!A:A,0)),\"\")","v":""},""]
[{"$f":"IF(ISERROR('Audit questions'!A27),\"\",'Audit questions'!A27)","v":"Test26"},{"$f":"IFERROR(INDEX(April!C:C,MATCH(Year!A:A,April!A:A,0)),\"\")","v":""},{"$f":"IFERROR(INDEX(May!C:C,MATCH(Year!A:A,May!A:A,0)),\"\")","v":""},{"$f":"IFERROR(INDEX(June!C:C,MATCH(Year!A:A,June!A:A,0)),\"\")","v":""},{"$f":"IFERROR(INDEX(July!C:C,MATCH(Year!A:A,July!A:A,0)),\"\")","v":""},{"$f":"IFERROR(INDEX(Aug!C:C,MATCH(Year!A:A,Aug!A:A,0)),\"\")","v":""},{"$f":"IFERROR(INDEX(Sept!C:C,MATCH(Year!A:A,Sept!A:A,0)),\"\")","v":""},{"$f":"IFERROR(INDEX(Oct!C:C,MATCH(Year!A:A,Oct!A:A,0)),\"\")","v":""},{"$f":"IFERROR(INDEX(Nov!C:C,MATCH(Year!A:A,Nov!A:A,0)),\"\")","v":""},{"$f":"IFERROR(INDEX(Dec!C:C,MATCH(Year!A:A,Dec!A:A,0)),\"\")","v":""},{"$f":"IFERROR(INDEX(Jan!C:C,MATCH(Year!A:A,Jan!A:A,0)),\"\")","v":""},{"$f":"IFERROR(INDEX(Feb!C:C,MATCH(Year!A:A,Feb!A:A,0)),\"\")","v":""},{"$f":"IFERROR(INDEX(March!C:C,MATCH(Year!A:A,March!A:A,0)),\"\")","v":""},""]
[{"$f":"IF(ISERROR('Audit questions'!A28),\"\",'Audit questions'!A28)","v":"Test27"},{"$f":"IFERROR(INDEX(April!C:C,MATCH(Year!A:A,April!A:A,0)),\"\")","v":""},{"$f":"IFERROR(INDEX(May!C:C,MATCH(Year!A:A,May!A:A,0)),\"\")","v":""},{"$f":"IFERROR(INDEX(June!C:C,MATCH(Year!A:A,June!A:A,0)),\"\")","v":""},{"$f":"IFERROR(INDEX(July!C:C,MATCH(Year!A:A,July!A:A,0)),\"\")","v":""},{"$f":"IFERROR(INDEX(Aug!C:C,MATCH(Year!A:A,Aug!A:A,0)),\"\")","v":""},{"$f":"IFERROR(INDEX(Sept!C:C,MATCH(Year!A:A,Sept!A:A,0)),\"\")","v":""},{"$f":"IFERROR(INDEX(Oct!C:C,MATCH(Year!A:A,Oct!A:A,0)),\"\")","v":""},{"$f":"IFERROR(INDEX(Nov!C:C,MATCH(Year!A:A,Nov!A:A,0)),\"\")","v":""},{"$f":"IFERROR(INDEX(Dec!C:C,MATCH(Year!A:A,Dec!A:A,0)),\"\")","v":""},{"$f":"IFERROR(INDEX(Jan!C:C,MATCH(Year!A:A,Jan!A:A,0)),\"\")","v":""},{"$f":"IFERROR(INDEX(Feb!C:C,MATCH(Year!A:A,Feb!A:A,0)),\"\")","v":""},{"$f":"IFERROR(INDEX(March!C:C,MATCH(Year!A:A,March!A:A,0)),\"\")","v":""},""]
[{"$f":"IF(ISERROR('Audit questions'!A29),\"\",'Audit questions'!A29)","v":"Test28"},{"$f":"IFERROR(INDEX(April!C:C,MATCH(Year!A:A,April!A:A,0)),\"\")","v":""},{"$f":"IFERROR(INDEX(May!C:C,MATCH(Year!A:A,May!A:A,0)),\"\")","v":""},{"$f":"IFERROR(INDEX(June!C:C,MATCH(Year!A:A,June!A:A,0)),\"\")","v":""},{"$f":"IFERROR(INDEX(July!C:C,MATCH(Year!A:A,July!A:A,0)),\"\")","v":""},{"$f":"IFERROR(INDEX(Aug!C:C,MATCH(Year!A:A,Aug!A:A,0)),\"\")","v":""},{"$f":"IFERROR(INDEX(Sept!C:C,MATCH(Year!A:A,Sept!A:A,0)),\"\")","v":""},{"$f":"IFERROR(INDEX(Oct!C:C,MATCH(Year!A:A,Oct!A:A,0)),\"\")","v":""},{"$f":"IFERROR(INDEX(Nov!C:C,MATCH(Year!A:A,Nov!A:A,0)),\"\")","v":""},{"$f":"IFERROR(INDEX(Dec!C:C,MATCH(Year!A:A,Dec!A:A,0)),\"\")","v":""},{"$f":"IFERROR(INDEX(Jan!C:C,MATCH(Year!A:A,Jan!A:A,0)),\"\")","v":""},{"$f":"IFERROR(INDEX(Feb!C:C,MATCH(Year!A:A,Feb!A:A,0)),\"\")","v":""},{"$f":"IFERROR(INDEX(March!C:C,MATCH(Year!A:A,March!A:A,0)),\"\")","v":""},""]
[{"$f":"IF(ISERROR('Audit questions'!A30),\"\",'Audit questions'!A30)","v":"Test29"},{"$f":"IFERROR(INDEX(April!C:C,MATCH(Year!A:A,April!A:A,0)),\"\")","v":""},{"$f":"IFERROR(INDEX(May!C:C,MATCH(Year!A:A,May!A:A,0)),\"\")","v":""},{"$f":"IFERROR(INDEX(June!C:C,MATCH(Year!A:A,June!A:A,0)),\"\")","v":""},{"$f":"IFERROR(INDEX(July!C:C,MATCH(Year!A:A,July!A:A,0)),\"\")","v":""},{"$f":"IFERROR(INDEX(Aug!C:C,MATCH(Year!A:A,Aug!A:A,0)),\"\")","v":""},{"$f":"IFERROR(INDEX(Sept!C:C,MATCH(Year!A:A,Sept!A:A,0)),\"\")","v":""},{"$f":"IFERROR(INDEX(Oct!C:C,MATCH(Year!A:A,Oct!A:A,0)),\"\")","v":""},{"$f":"IFERROR(INDEX(Nov!C:C,MATCH(Year!A:A,Nov!A:A,0)),\"\")","v":""},{"$f":"IFERROR(INDEX(Dec!C:C,MATCH(Year!A:A,Dec!A:A,0)),\"\")","v":""},{"$f":"IFERROR(INDEX(Jan!C:C,MATCH(Year!A:A,Jan!A:A,0)),\"\")","v":""},{"$f":"IFERROR(INDEX(Feb!C:C,MATCH(Year!A:A,Feb!A:A,0)),\"\")","v":""},{"$f":"IFERROR(INDEX(March!C:C,MATCH(Year!A:A,March!A:A,0)),\"\")","v":""},""]
[{"$f":"IF(ISERROR('Audit questions'!A31),\"\",'Audit questions'!A31)","v":"Test30"},{"$f":"IFERROR(INDEX(April!C:C,MATCH(Year!A:A,April!A:A,0)),\"\")","v":""},{"$f":"IFERROR(INDEX(May!C:C,MATCH(Year!A:A,May!A:A,0)),\"\")","v":""},{"$f":"IFERROR(INDEX(June!C:C,MATCH(Year!A:A,June!A:A,0)),\"\")","v":""},{"$f":"IFERROR(INDEX(July!C:C,MATCH(Year!A:A,July!A:A,0)),\"\")","v":""},{"$f":"IFERROR(INDEX(Aug!C:C,MATCH(Year!A:A,Aug!A:A,0)),\"\")","v":""},{"$f":"IFERROR(INDEX(Sept!C:C,MATCH(Year!A:A,Sept!A:A,0)),\"\")","v":""},{"$f":"IFERROR(INDEX(Oct!C:C,MATCH(Year!A:A,Oct!A:A,0)),\"\")","v":""},{"$f":"IFERROR(INDEX(Nov!C:C,MATCH(Year!A:A,Nov!A:A,0)),\"\")","v":""},{"$f":"IFERROR(INDEX(Dec!C:C,MATCH(Year!A:A,Dec!A:A,0)),\"\")","v":""},{"$f":"IFERROR(INDEX(Jan!C:C,MATCH(Year!A:A,Jan!A:A,0)),\"\")","v":""},{"$f":"IFERROR(INDEX(Feb!C:C,MATCH(Year!A:A,Feb!A:A,0)),\"\")","v":""},{"$f":"IFERROR(INDEX(March!C:C,MATCH(Year!A:A,March!A:A,0)),\"\")","v":""},""]
[{"$f":"IF(ISERROR('Audit questions'!A32),\"\",'Audit questions'!A32)","v":"Test31"},{"$f":"IFERROR(INDEX(April!C:C,MATCH(Year!A:A,April!A:A,0)),\"\")","v":""},{"$f":"IFERROR(INDEX(May!C:C,MATCH(Year!A:A,May!A:A,0)),\"\")","v":""},{"$f":"IFERROR(INDEX(June!C:C,MATCH(Year!A:A,June!A:A,0)),\"\")","v":""},{"$f":"IFERROR(INDEX(July!C:C,MATCH(Year!A:A,July!A:A,0)),\"\")","v":""},{"$f":"IFERROR(INDEX(Aug!C:C,MATCH(Year!A:A,Aug!A:A,0)),\"\")","v":""},{"$f":"IFERROR(INDEX(Sept!C:C,MATCH(Year!A:A,Sept!A:A,0)),\"\")","v":""},{"$f":"IFERROR(INDEX(Oct!C:C,MATCH(Year!A:A,Oct!A:A,0)),\"\")","v":""},{"$f":"IFERROR(INDEX(Nov!C:C,MATCH(Year!A:A,Nov!A:A,0)),\"\")","v":""},{"$f":"IFERROR(INDEX(Dec!C:C,MATCH(Year!A:A,Dec!A:A,0)),\"\")","v":""},{"$f":"IFERROR(INDEX(Jan!C:C,MATCH(Year!A:A,Jan!A:A,0)),\"\")","v":""},{"$f":"IFERROR(INDEX(Feb!C:C,MATCH(Year!A:A,Feb!A:A,0)),\"\")","v":""},{"$f":"IFERROR(INDEX(March!C:C,MATCH(Year!A:A,March!A:A,0)),\"\")","v":""},""]
[{"$f":"IF(ISERROR('Audit questions'!A33),\"\",'Audit questions'!A33)","v":"Test32"},{"$f":"IFERROR(INDEX(April!C:C,MATCH(Year!A:A,April!A:A,0)),\"\")","v":""},{"$f":"IFERROR(INDEX(May!C:C,MATCH(Year!A:A,May!A:A,0)),\"\")","v":""},{"$f":"IFERROR(INDEX(June!C:C,MATCH(Year!A:A,June!A:A,0)),\"\")","v":""},{"$f":"IFERROR(INDEX(July!C:C,MATCH(Year!A:A,July!A:A,0)),\"\")","v":""},{"$f":"IFERROR(INDEX(Aug!C:C,MATCH(Year!A:A,Aug!A:A,0)),\"\")","v":""},{"$f":"IFERROR(INDEX(Sept!C:C,MATCH(Year!A:A,Sept!A:A,0)),\"\")","v":""},{"$f":"IFERROR(INDEX(Oct!C:C,MATCH(Year!A:A,Oct!A:A,0)),\"\")","v":""},{"$f":"IFERROR(INDEX(Nov!C:C,MATCH(Year!A:A,Nov!A:A,0)),\"\")","v":""},{"$f":"IFERROR(INDEX(Dec!C:C,MATCH(Year!A:A,Dec!A:A,0)),\"\")","v":""},{"$f":"IFERROR(INDEX(Jan!C:C,MATCH(Year!A:A,Jan!A:A,0)),\"\")","v":""},{"$f":"IFERROR(INDEX(Feb!C:C,MATCH(Year!A:A,Feb!A:A,0)),\"\")","v":""},{"$f":"IFERROR(INDEX(March!C:C,MATCH(Year!A:A,March!A:A,0)),\"\")","v":""},""]
[{"$f":"IF(ISERROR('Audit questions'!A34),\"\",'Audit questions'!A34)","v":"Test33"},{"$f":"IFERROR(INDEX(April!C:C,MATCH(Year!A:A,April!A:A,0)),\"\")","v":""},{"$f":"IFERROR(INDEX(May!C:C,MATCH(Year!A:A,May!A:A,0)),\"\")","v":""},{"$f":"IFERROR(INDEX(June!C:C,MATCH(Year!A:A,June!A:A,0)),\"\")","v":""},{"$f":"IFERROR(INDEX(July!C:C,MATCH(Year!A:A,July!A:A,0)),\"\")","v":""},{"$f":"IFERROR(INDEX(Aug!C:C,MATCH(Year!A:A,Aug!A:A,0)),\"\")","v":""},{"$f":"IFERROR(INDEX(Sept!C:C,MATCH(Year!A:A,Sept!A:A,0)),\"\")","v":""},{"$f":"IFERROR(INDEX(Oct!C:C,MATCH(Year!A:A,Oct!A:A,0)),\"\")","v":""},{"$f":"IFERROR(INDEX(Nov!C:C,MATCH(Year!A:A,Nov!A:A,0)),\"\")","v":""},{"$f":"IFERROR(INDEX(Dec!C:C,MATCH(Year!A:A,Dec!A:A,0)),\"\")","v":""},{"$f":"IFERROR(INDEX(Jan!C:C,MATCH(Year!A:A,Jan!A:A,0)),\"\")","v":""},{"$f":"IFERROR(INDEX(Feb!C:C,MATCH(Year!A:A,Feb!A:A,0)),\"\")","v":""},{"$f":"IFERROR(INDEX(March!C:C,MATCH(Year!A:A,March!A:A,0)),\"\")","v":""},""]
[{"$f":"IF(ISERROR('Audit questions'!A35),\"\",'Audit questions'!A35)","v":"Test34"},{"$f":"IFERROR(INDEX(April!C:C,MATCH(Year!A:A,April!A:A,0)),\"\")","v":""},{"$f":"IFERROR(INDEX(May!C:C,MATCH(Year!A:A,May!A:A,0)),\"\")","v":""},{"$f":"IFERROR(INDEX(June!C:C,MATCH(Year!A:A,June!A:A,0)),\"\")","v":""},{"$f":"IFERROR(INDEX(July!C:C,MATCH(Year!A:A,July!A:A,0)),\"\")","v":""},{"$f":"IFERROR(INDEX(Aug!C:C,MATCH(Year!A:A,Aug!A:A,0)),\"\")","v":""},{"$f":"IFERROR(INDEX(Sept!C:C,MATCH(Year!A:A,Sept!A:A,0)),\"\")","v":""},{"$f":"IFERROR(INDEX(Oct!C:C,MATCH(Year!A:A,Oct!A:A,0)),\"\")","v":""},{"$f":"IFERROR(INDEX(Nov!C:C,MATCH(Year!A:A,Nov!A:A,0)),\"\")","v":""},{"$f":"IFERROR(INDEX(Dec!C:C,MATCH(Year!A:A,Dec!A:A,0)),\"\")","v":""},{"$f":"IFERROR(INDEX(Jan!C:C,MATCH(Year!A:A,Jan!A:A,0)),\"\")","v":""},{"$f":"IFERROR(INDEX(Feb!C:C,MATCH(Year!A:A,Feb!A:A,0)),\"\")","v":""},{"$f":"IFERROR(INDEX(March!C:C,MATCH(Year!A:A,March!A:A,0)),\"\")","v":""},""]
[{"$f":"IF(ISERROR('Audit questions'!A36),\"\",'Audit questions'!A36)","v":"Test35"},{"$f":"IFERROR(INDEX(April!C:C,MATCH(Year!A:A,April!A:A,0)),\"\")","v":""},{"$f":"IFERROR(INDEX(May!C:C,MATCH(Year!A:A,May!A:A,0)),\"\")","v":""},{"$f":"IFERROR(INDEX(June!C:C,MATCH(Year!A:A,June!A:A,0)),\"\")","v":""},{"$f":"IFERROR(INDEX(July!C:C,MATCH(Year!A:A,July!A:A,0)),\"\")","v":""},{"$f":"IFERROR(INDEX(Aug!C:C,MATCH(Year!A:A,Aug!A:A,0)),\"\")","v":""},{"$f":"IFERROR(INDEX(Sept!C:C,MATCH(Year!A:A,Sept!A:A,0)),\"\")","v":""},{"$f":"IFERROR(INDEX(Oct!C:C,MATCH(Year!A:A,Oct!A:A,0)),\"\")","v":""},{"$f":"IFERROR(INDEX(Nov!C:C,MATCH(Year!A:A,Nov!A:A,0)),\"\")","v":""},{"$f":"IFERROR(INDEX(Dec!C:C,MATCH(Year!A:A,Dec!A:A,0)),\"\")","v":""},{"$f":"IFERROR(INDEX(Jan!C:C,MATCH(Year!A:A,Jan!A:A,0)),\"\")","v":""},{"$f":"IFERROR(INDEX(Feb!C:C,MATCH(Year!A:A,Feb!A:A,0)),\"\")","v":""},{"$f":"IFERROR(INDEX(March!C:C,MATCH(Year!A:A,March!A:A,0)),\"\")","v":""},""]
[{"$f":"IF(ISERROR('Audit questions'!A37),\"\",'Audit questions'!A37)","v":"Test36"},{"$f":"IFERROR(INDEX(April!C:C,MATCH(Year!A:A,April!A:A,0)),\"\")","v":""},{"$f":"IFERROR(INDEX(May!C:C,MATCH(Year!A:A,May!A:A,0)),\"\")","v":""},{"$f":"IFERROR(INDEX(June!C:C,MATCH(Year!A:A,June!A:A,0)),\"\")","v":""},{"$f":"IFERROR(INDEX(July!C:C,MATCH(Year!A:A,July!A:A,0)),\"\")","v":""},{"$f":"IFERROR(INDEX(Aug!C:C,MATCH(Year!A:A,Aug!A:A,0)),\"\")","v":""},{"$f":"IFERROR(INDEX(Sept!C:C,MATCH(Year!A:A,Sept!A:A,0)),\"\")","v":""},{"$f":"IFERROR(INDEX(Oct!C:C,MATCH(Year!A:A,Oct!A:A,0)),\"\")","v":""},{"$f":"IFERROR(INDEX(Nov!C:C,MATCH(Year!A:A,Nov!A:A,0)),\"\")","v":""},{"$f":"IFERROR(INDEX(Dec!C:C,MATCH(Year!A:A,Dec!A:A,0)),\"\")","v":""},{"$f":"IFERROR(INDEX(Jan!C:C,MATCH(Year!A:A,Jan!A:A,0)),\"\")","v":""},{"$f":"IFERROR(INDEX(Feb!C:C,MATCH(Year!A:A,Feb!A:A,0)),\"\")","v":""},{"$f":"IFERROR(INDEX(March!C:C,MATCH(Year!A:A,March!A:A,0)),\"\")","v":""},""]
[{"$f":"IF(ISERROR('Audit questions'!A38),\"\",'Audit questions'!A38)","v":"Test37"},{"$f":"IFERROR(INDEX(April!C:C,MATCH(Year!A:A,April!A:A,0)),\"\")","v":""},{"$f":"IFERROR(INDEX(May!C:C,MATCH(Year!A:A,May!A:A,0)),\"\")","v":""},{"$f":"IFERROR(INDEX(June!C:C,MATCH(Year!A:A,June!A:A,0)),\"\")","v":""},{"$f":"IFERROR(INDEX(July!C:C,MATCH(Year!A:A,July!A:A,0)),\"\")","v":""},{"$f":"IFERROR(INDEX(Aug!C:C,MATCH(Year!A:A,Aug!A:A,0)),\"\")","v":""},{"$f":"IFERROR(INDEX(Sept!C:C,MATCH(Year!A:A,Sept!A:A,0)),\"\")","v":""},{"$f":"IFERROR(INDEX(Oct!C:C,MATCH(Year!A:A,Oct!A:A,0)),\"\")","v":""},{"$f":"IFERROR(INDEX(Nov!C:C,MATCH(Year!A:A,Nov!A:A,0)),\"\")","v":""},{"$f":"IFERROR(INDEX(Dec!C:C,MATCH(Year!A:A,Dec!A:A,0)),\"\")","v":""},{"$f":"IFERROR(INDEX(Jan!C:C,MATCH(Year!A:A,Jan!A:A,0)),\"\")","v":""},{"$f":"IFERROR(INDEX(Feb!C:C,MATCH(Year!A:A,Feb!A:A,0)),\"\")","v":""},{"$f":"IFERROR(INDEX(March!C:C,MATCH(Year!A:A,March!A:A,0)),\"\")","v":""},""]
[{"$f":"IF(ISERROR('Audit questions'!A39),\"\",'Audit questions'!A39)","v":"Test38"},{"$f":"IFERROR(INDEX(April!C:C,MATCH(Year!A:A,April!A:A,0)),\"\")","v":""},{"$f":"IFERROR(INDEX(May!C:C,MATCH(Year!A:A,May!A:A,0)),\"\")","v":""},{"$f":"IFERROR(INDEX(June!C:C,MATCH(Year!A:A,June!A:A,0)),\"\")","v":""},{"$f":"IFERROR(INDEX(July!C:C,MATCH(Year!A:A,July!A:A,0)),\"\")","v":""},{"$f":"IFERROR(INDEX(Aug!C:C,MATCH(Year!A:A,Aug!A:A,0)),\"\")","v":""},{"$f":"IFERROR(INDEX(Sept!C:C,MATCH(Year!A:A,Sept!A:A,0)),\"\")","v":""},{"$f":"IFERROR(INDEX(Oct!C:C,MATCH(Year!A:A,Oct!A:A,0)),\"\")","v":""},{"$f":"IFERROR(INDEX(Nov!C:C,MATCH(Year!A:A,Nov!A:A,0)),\"\")","v":""},{"$f":"IFERROR(INDEX(Dec!C:C,MATCH(Year!A:A,Dec!A:A,0)),\"\")","v":""},{"$f":"IFERROR(INDEX(Jan!C:C,MATCH(Year!A:A,Jan!A:A,0)),\"\")","v":""},{"$f":"IFERROR(INDEX(Feb!C:C,MATCH(Year!A:A,Feb!A:A,0)),\"\")","v":""},{"$f":"IFERROR(INDEX(March!C:C,MATCH(Year!A:A,March!A:A,0)),\"\")","v":""},""]
[{"$f":"IF(ISERROR('Audit questions'!A40),\"\",'Audit questions'!A40)","v":"Test39"},{"$f":"IFERROR(INDEX(April!C:C,MATCH(Year!A:A,April!A:A,0)),\"\")","v":""},{"$f":"IFERROR(INDEX(May!C:C,MATCH(Year!A:A,May!A:A,0)),\"\")","v":""},{"$f":"IFERROR(INDEX(June!C:C,MATCH(Year!A:A,June!A:A,0)),\"\")","v":""},{"$f":"IFERROR(INDEX(July!C:C,MATCH(Year!A:A,July!A:A,0)),\"\")","v":""},{"$f":"IFERROR(INDEX(Aug!C:C,MATCH(Year!A:A,Aug!A:A,0)),\"\")","v":""},{"$f":"IFERROR(INDEX(Sept!C:C,MATCH(Year!A:A,Sept!A:A,0)),\"\")","v":""},{"$f":"IFERROR(INDEX(Oct!C:C,MATCH(Year!A:A,Oct!A:A,0)),\"\")","v":""},{"$f":"IFERROR(INDEX(Nov!C:C,MATCH(Year!A:A,Nov!A:A,0)),\"\")","v":""},{"$f":"IFERROR(INDEX(Dec!C:C,MATCH(Year!A:A,Dec!A:A,0)),\"\")","v":""},{"$f":"IFERROR(INDEX(Jan!C:C,MATCH(Year!A:A,Jan!A:A,0)),\"\")","v":""},{"$f":"IFERROR(INDEX(Feb!C:C,MATCH(Year!A:A,Feb!A:A,0)),\"\")","v":""},{"$f":"IFERROR(INDEX(March!C:C,MATCH(Year!A:A,March!A:A,0)),\"\")","v":""},""]
[{"$f":"IF(ISERROR('Audit questions'!A41),\"\",'Audit questions'!A41)","v":"Test40"},{"$f":"IFERROR(INDEX(April!C:C,MATCH(Year!A:A,April!A:A,0)),\"\")","v":""},{"$f":"IFERROR(INDEX(May!C:C,MATCH(Year!A:A,May!A:A,0)),\"\")","v":""},{"$f":"IFERROR(INDEX(June!C:C,MATCH(Year!A:A,June!A:A,0)),\"\")","v":""},{"$f":"IFERROR(INDEX(July!C:C,MATCH(Year!A:A,July!A:A,0)),\"\")","v":""},{"$f":"IFERROR(INDEX(Aug!C:C,MATCH(Year!A:A,Aug!A:A,0)),\"\")","v":""},{"$f":"IFERROR(INDEX(Sept!C:C,MATCH(Year!A:A,Sept!A:A,0)),\"\")","v":""},{"$f":"IFERROR(INDEX(Oct!C:C,MATCH(Year!A:A,Oct!A:A,0)),\"\")","v":""},{"$f":"IFERROR(INDEX(Nov!C:C,MATCH(Year!A:A,Nov!A:A,0)),\"\")","v":""},{"$f":"IFERROR(INDEX(Dec!C:C,MATCH(Year!A:A,Dec!A:A,0)),\"\")","v":""},{"$f":"IFERROR(INDEX(Jan!C:C,MATCH(Year!A:A,Jan!A:A,0)),\"\")","v":""},{"$f":"IFERROR(INDEX(Feb!C:C,MATCH(Year!A:A,Feb!A:A,0)),\"\")","v":""},{"$f":"IFERROR(INDEX(March!C:C,MATCH(Year!A:A,March!A:A,0)),\"\")","v":""},""]
["Average",{"$f":"IF(ISERROR((SUM(B58:B97)/April!B8)),\"\",(SUM(B58:B97)/April!B8))","v":""},{"$f":"IF(ISERROR((SUM(C58:C97)/May!B8)),\"\",(SUM(C58:C97)/May!B8))","v":""},{"$f":"IF(ISERROR((SUM(D58:D97)/June!B8)),\"\",(SUM(D58:D97)/June!B8))","v":""},{"$f":"IF(ISERROR((SUM(E58:E97)/July!B8)),\"\",(SUM(E58:E97)/July!B8))","v":""},{"$f":"IF(ISERROR((SUM(F58:F97)/Aug!B8)),\"\",(SUM(F58:F97)/Aug!B8))","v":""},{"$f":"IF(ISERROR((SUM(G58:G97)/Sept!B8)),\"\",(SUM(G58:G97)/Sept!B8))","v":""},{"$f":"IF(ISERROR((SUM(H58:H97)/Oct!B8)),\"\",(SUM(H58:H97)/Oct!B8))","v":""},{"$f":"IF(ISERROR((SUM(I58:I97)/Nov!B8)),\"\",(SUM(I58:I97)/Nov!B8))","v":""},{"$f":"IF(ISERROR((SUM(J58:J97)/Dec!B8)),\"\",(SUM(J58:J97)/Dec!B8))","v":""},{"$f":"IF(ISERROR((SUM(K58:K97)/Jan!B8)),\"\",(SUM(K58:K97)/Jan!B8))","v":""},{"$f":"IF(ISERROR((SUM(L58:L97)/Feb!B8)),\"\",(SUM(L58:L97)/Feb!B8))","v":""},{"$f":"IF(ISERROR((SUM(M58:M97)/March!B8)),\"\",(SUM(M58:M97)/March!B8))","v":""},{"$f":"IF(ISERROR((SUM(B98:M98))/B4),\"\",(SUM(B98:M98))/B4)","v":""}]
[]
["Justified"]
["Metric","April","May","June","July","August","September","October","November","December","January","February","March","Year average"]
[{"$f":"IF(ISERROR('Audit questions'!A2),\"\",'Audit questions'!A2)","v":"Test1"},{"$f":"IFERROR(INDEX(April!D:D,MATCH(Year!A:A,April!A:A,0)),\"\")","v":""},{"$f":"IFERROR(INDEX(May!D:D,MATCH(Year!A:A,May!A:A,0)),\"\")","v":""},{"$f":"IFERROR(INDEX(June!D:D,MATCH(Year!A:A,June!A:A,0)),\"\")","v":""},{"$f":"IFERROR(INDEX(July!D:D,MATCH(Year!A:A,July!A:A,0)),\"\")","v":""},{"$f":"IFERROR(INDEX(Aug!D:D,MATCH(Year!A:A,Aug!A:A,0)),\"\")","v":""},{"$f":"IFERROR(INDEX(Sept!D:D,MATCH(Year!A:A,Sept!A:A,0)),\"\")","v":""},{"$f":"IFERROR(INDEX(Oct!D:D,MATCH(Year!A:A,Oct!A:A,0)),\"\")","v":""},{"$f":"IFERROR(INDEX(Nov!D:D,MATCH(Year!A:A,Nov!A:A,0)),\"\")","v":""},{"$f":"IFERROR(INDEX(Dec!D:D,MATCH(Year!A:A,Dec!A:A,0)),\"\")","v":""},{"$f":"IFERROR(INDEX(Jan!D:D,MATCH(Year!A:A,Jan!A:A,0)),\"\")","v":""},{"$f":"IFERROR(INDEX(Feb!D:D,MATCH(Year!A:A,Feb!A:A,0)),\"\")","v":""},{"$f":"IFERROR(INDEX(March!D:D,MATCH(Year!A:A,March!A:A,0)),\"\")","v":""},{"$f":"IF(ISERROR((SUM(B102:M102))/B4),\"\",(SUM(B102:M102))/B4)","v":""}]
[{"$f":"IF(ISERROR('Audit questions'!A3),\"\",'Audit questions'!A3)","v":"Test2"},{"$f":"IFERROR(INDEX(April!D:D,MATCH(Year!A:A,April!A:A,0)),\"\")","v":""},{"$f":"IFERROR(INDEX(May!D:D,MATCH(Year!A:A,May!A:A,0)),\"\")","v":""},{"$f":"IFERROR(INDEX(June!D:D,MATCH(Year!A:A,June!A:A,0)),\"\")","v":""},{"$f":"IFERROR(INDEX(July!D:D,MATCH(Year!A:A,July!A:A,0)),\"\")","v":""},{"$f":"IFERROR(INDEX(Aug!D:D,MATCH(Year!A:A,Aug!A:A,0)),\"\")","v":""},{"$f":"IFERROR(INDEX(Sept!D:D,MATCH(Year!A:A,Sept!A:A,0)),\"\")","v":""},{"$f":"IFERROR(INDEX(Oct!D:D,MATCH(Year!A:A,Oct!A:A,0)),\"\")","v":""},{"$f":"IFERROR(INDEX(Nov!D:D,MATCH(Year!A:A,Nov!A:A,0)),\"\")","v":""},{"$f":"IFERROR(INDEX(Dec!D:D,MATCH(Year!A:A,Dec!A:A,0)),\"\")","v":""},{"$f":"IFERROR(INDEX(Jan!D:D,MATCH(Year!A:A,Jan!A:A,0)),\"\")","v":""},{"$f":"IFERROR(INDEX(Feb!D:D,MATCH(Year!A:A,Feb!A:A,0)),\"\")","v":""},{"$f":"IFERROR(INDEX(March!D:D,MATCH(Year!A:A,March!A:A,0)),\"\")","v":""},{"$f":"IF(ISERROR((SUM(B103:M103))/B4),\"\",(SUM(B103:M103))/B4)","v":""}]
[{"$f":"IF(ISERROR('Audit questions'!A4),\"\",'Audit questions'!A4)","v":"Test3"},{"$f":"IFERROR(INDEX(April!D:D,MATCH(Year!A:A,April!A:A,0)),\"\")","v":""},{"$f":"IFERROR(INDEX(May!D:D,MATCH(Year!A:A,May!A:A,0)),\"\")","v":""},{"$f":"IFERROR(INDEX(June!D:D,MATCH(Year!A:A,June!A:A,0)),\"\")","v":""},{"$f":"IFERROR(INDEX(July!D:D,MATCH(Year!A:A,July!A:A,0)),\"\")","v":""},{"$f":"IFERROR(INDEX(Aug!D:D,MATCH(Year!A:A,Aug!A:A,0)),\"\")","v":""},{"$f":"IFERROR(INDEX(Sept!D:D,MATCH(Year!A:A,Sept!A:A,0)),\"\")","v":""},{"$f":"IFERROR(INDEX(Oct!D:D,MATCH(Year!A:A,Oct!A:A,0)),\"\")","v":""},{"$f":"IFERROR(INDEX(Nov!D:D,MATCH(Year!A:A,Nov!A:A,0)),\"\")","v":""},{"$f":"IFERROR(INDEX(Dec!D:D,MATCH(Year!A:A,Dec!A:A,0)),\"\")","v":""},{"$f":"IFERROR(INDEX(Jan!D:D,MATCH(Year!A:A,Jan!A:A,0)),\"\")","v":""},{"$f":"IFERROR(INDEX(Feb!D:D,MATCH(Year!A:A,Feb!A:A,0)),\"\")","v":""},{"$f":"IFERROR(INDEX(March!D:D,MATCH(Year!A:A,March!A:A,0)),\"\")","v":""},{"$f":"IF(ISERROR((SUM(B104:M104))/B4),\"\",(SUM(B104:M104))/B4)","v":""}]
[{"$f":"IF(ISERROR('Audit questions'!A5),\"\",'Audit questions'!A5)","v":"Test4"},{"$f":"IFERROR(INDEX(April!D:D,MATCH(Year!A:A,April!A:A,0)),\"\")","v":""},{"$f":"IFERROR(INDEX(May!D:D,MATCH(Year!A:A,May!A:A,0)),\"\")","v":""},{"$f":"IFERROR(INDEX(June!D:D,MATCH(Year!A:A,June!A:A,0)),\"\")","v":""},{"$f":"IFERROR(INDEX(July!D:D,MATCH(Year!A:A,July!A:A,0)),\"\")","v":""},{"$f":"IFERROR(INDEX(Aug!D:D,MATCH(Year!A:A,Aug!A:A,0)),\"\")","v":""},{"$f":"IFERROR(INDEX(Sept!D:D,MATCH(Year!A:A,Sept!A:A,0)),\"\")","v":""},{"$f":"IFERROR(INDEX(Oct!D:D,MATCH(Year!A:A,Oct!A:A,0)),\"\")","v":""},{"$f":"IFERROR(INDEX(Nov!D:D,MATCH(Year!A:A,Nov!A:A,0)),\"\")","v":""},{"$f":"IFERROR(INDEX(Dec!D:D,MATCH(Year!A:A,Dec!A:A,0)),\"\")","v":""},{"$f":"IFERROR(INDEX(Jan!D:D,MATCH(Year!A:A,Jan!A:A,0)),\"\")","v":""},{"$f":"IFERROR(INDEX(Feb!D:D,MATCH(Year!A:A,Feb!A:A,0)),\"\")","v":""},{"$f":"IFERROR(INDEX(March!D:D,MATCH(Year!A:A,March!A:A,0)),\"\")","v":""},{"$f":"IF(ISERROR((SUM(B105:M105))/B4),\"\",(SUM(B105:M105))/B4)","v":""}]
[{"$f":"IF(ISERROR('Audit questions'!A6),\"\",'Audit questions'!A6)","v":"Test5"},{"$f":"IFERROR(INDEX(April!D:D,MATCH(Year!A:A,April!A:A,0)),\"\")","v":""},{"$f":"IFERROR(INDEX(May!D:D,MATCH(Year!A:A,May!A:A,0)),\"\")","v":""},{"$f":"IFERROR(INDEX(June!D:D,MATCH(Year!A:A,June!A:A,0)),\"\")","v":""},{"$f":"IFERROR(INDEX(July!D:D,MATCH(Year!A:A,July!A:A,0)),\"\")","v":""},{"$f":"IFERROR(INDEX(Aug!D:D,MATCH(Year!A:A,Aug!A:A,0)),\"\")","v":""},{"$f":"IFERROR(INDEX(Sept!D:D,MATCH(Year!A:A,Sept!A:A,0)),\"\")","v":""},{"$f":"IFERROR(INDEX(Oct!D:D,MATCH(Year!A:A,Oct!A:A,0)),\"\")","v":""},{"$f":"IFERROR(INDEX(Nov!D:D,MATCH(Year!A:A,Nov!A:A,0)),\"\")","v":""},{"$f":"IFERROR(INDEX(Dec!D:D,MATCH(Year!A:A,Dec!A:A,0)),\"\")","v":""},{"$f":"IFERROR(INDEX(Jan!D:D,MATCH(Year!A:A,Jan!A:A,0)),\"\")","v":""},{"$f":"IFERROR(INDEX(Feb!D:D,MATCH(Year!A:A,Feb!A:A,0)),\"\")","v":""},{"$f":"IFERROR(INDEX(March!D:D,MATCH(Year!A:A,March!A:A,0)),\"\")","v":""},{"$f":"IF(ISERROR((SUM(B106:M106))/B4),\"\",(SUM(B106:M106))/B4)","v":""}]
[{"$f":"IF(ISERROR('Audit questions'!A7),\"\",'Audit questions'!A7)","v":"Test6"},{"$f":"IFERROR(INDEX(April!D:D,MATCH(Year!A:A,April!A:A,0)),\"\")","v":""},{"$f":"IFERROR(INDEX(May!D:D,MATCH(Year!A:A,May!A:A,0)),\"\")","v":""},{"$f":"IFERROR(INDEX(June!D:D,MATCH(Year!A:A,June!A:A,0)),\"\")","v":""},{"$f":"IFERROR(INDEX(July!D:D,MATCH(Year!A:A,July!A:A,0)),\"\")","v":""},{"$f":"IFERROR(INDEX(Aug!D:D,MATCH(Year!A:A,Aug!A:A,0)),\"\")","v":""},{"$f":"IFERROR(INDEX(Sept!D:D,MATCH(Year!A:A,Sept!A:A,0)),\"\")","v":""},{"$f":"IFERROR(INDEX(Oct!D:D,MATCH(Year!A:A,Oct!A:A,0)),\"\")","v":""},{"$f":"IFERROR(INDEX(Nov!D:D,MATCH(Year!A:A,Nov!A:A,0)),\"\")","v":""},{"$f":"IFERROR(INDEX(Dec!D:D,MATCH(Year!A:A,Dec!A:A,0)),\"\")","v":""},{"$f":"IFERROR(INDEX(Jan!D:D,MATCH(Year!A:A,Jan!A:A,0)),\"\")","v":""},{"$f":"IFERROR(INDEX(Feb!D:D,MATCH(Year!A:A,Feb!A:A,0)),\"\")","v":""},{"$f":"IFERROR(INDEX(March!D:D,MATCH(Year!A:A,March!A:A,0)),\"\")","v":""},{"$f":"IF(ISERROR((SUM(B107:M107))/B4),\"\",(SUM(B107:M107))/B4)","v":""}]
[{"$f":"IF(ISERROR('Audit questions'!A8),\"\",'Audit questions'!A8)","v":"Test7"},{"$f":"IFERROR(INDEX(April!D:D,MATCH(Year!A:A,April!A:A,0)),\"\")","v":""},{"$f":"IFERROR(INDEX(May!D:D,MATCH(Year!A:A,May!A:A,0)),\"\")","v":""},{"$f":"IFERROR(INDEX(June!D:D,MATCH(Year!A:A,June!A:A,0)),\"\")","v":""},{"$f":"IFERROR(INDEX(July!D:D,MATCH(Year!A:A,July!A:A,0)),\"\")","v":""},{"$f":"IFERROR(INDEX(Aug!D:D,MATCH(Year!A:A,Aug!A:A,0)),\"\")","v":""},{"$f":"IFERROR(INDEX(Sept!D:D,MATCH(Year!A:A,Sept!A:A,0)),\"\")","v":""},{"$f":"IFERROR(INDEX(Oct!D:D,MATCH(Year!A:A,Oct!A:A,0)),\"\")","v":""},{"$f":"IFERROR(INDEX(Nov!D:D,MATCH(Year!A:A,Nov!A:A,0)),\"\")","v":""},{"$f":"IFERROR(INDEX(Dec!D:D,MATCH(Year!A:A,Dec!A:A,0)),\"\")","v":""},{"$f":"IFERROR(INDEX(Jan!D:D,MATCH(Year!A:A,Jan!A:A,0)),\"\")","v":""},{"$f":"IFERROR(INDEX(Feb!D:D,MATCH(Year!A:A,Feb!A:A,0)),\"\")","v":""},{"$f":"IFERROR(INDEX(March!D:D,MATCH(Year!A:A,March!A:A,0)),\"\")","v":""},{"$f":"IF(ISERROR((SUM(B108:M108))/B4),\"\",(SUM(B108:M108))/B4)","v":""}]
[{"$f":"IF(ISERROR('Audit questions'!A9),\"\",'Audit questions'!A9)","v":"Test8"},{"$f":"IFERROR(INDEX(April!D:D,MATCH(Year!A:A,April!A:A,0)),\"\")","v":""},{"$f":"IFERROR(INDEX(May!D:D,MATCH(Year!A:A,May!A:A,0)),\"\")","v":""},{"$f":"IFERROR(INDEX(June!D:D,MATCH(Year!A:A,June!A:A,0)),\"\")","v":""},{"$f":"IFERROR(INDEX(July!D:D,MATCH(Year!A:A,July!A:A,0)),\"\")","v":""},{"$f":"IFERROR(INDEX(Aug!D:D,MATCH(Year!A:A,Aug!A:A,0)),\"\")","v":""},{"$f":"IFERROR(INDEX(Sept!D:D,MATCH(Year!A:A,Sept!A:A,0)),\"\")","v":""},{"$f":"IFERROR(INDEX(Oct!D:D,MATCH(Year!A:A,Oct!A:A,0)),\"\")","v":""},{"$f":"IFERROR(INDEX(Nov!D:D,MATCH(Year!A:A,Nov!A:A,0)),\"\")","v":""},{"$f":"IFERROR(INDEX(Dec!D:D,MATCH(Year!A:A,Dec!A:A,0)),\"\")","v":""},{"$f":"IFERROR(INDEX(Jan!D:D,MATCH(Year!A:A,Jan!A:A,0)),\"\")","v":""},{"$f":"IFERROR(INDEX(Feb!D:D,MATCH(Year!A:A,Feb!A:A,0)),\"\")","v":""},{"$f":"IFERROR(INDEX(March!D:D,MATCH(Year!A:A,March!A:A,0)),\"\")","v":""},{"$f":"IF(ISERROR((SUM(B109:M109))/B4),\"\",(SUM(B109:M109))/B4)","v":""}]
[{"$f":"IF(ISERROR('Audit questions'!A10),\"\",'Audit questions'!A10)","v":"Test9"},{"$f":"IFERROR(INDEX(April!D:D,MATCH(Year!A:A,April!A:A,0)),\"\")","v":""},{"$f":"IFERROR(INDEX(May!D:D,MATCH(Year!A:A,May!A:A,0)),\"\")","v":""},{"$f":"IFERROR(INDEX(June!D:D,MATCH(Year!A:A,June!A:A,0)),\"\")","v":""},{"$f":"IFERROR(INDEX(July!D:D,MATCH(Year!A:A,July!A:A,0)),\"\")","v":""},{"$f":"IFERROR(INDEX(Aug!D:D,MATCH(Year!A:A,Aug!A:A,0)),\"\")","v":""},{"$f":"IFERROR(INDEX(Sept!D:D,MATCH(Year!A:A,Sept!A:A,0)),\"\")","v":""},{"$f":"IFERROR(INDEX(Oct!D:D,MATCH(Year!A:A,Oct!A:A,0)),\"\")","v":""},{"$f":"IFERROR(INDEX(Nov!D:D,MATCH(Year!A:A,Nov!A:A,0)),\"\")","v":""},{"$f":"IFERROR(INDEX(Dec!D:D,MATCH(Year!A:A,Dec!A:A,0)),\"\")","v":""},{"$f":"IFERROR(INDEX(Jan!D:D,MATCH(Year!A:A,Jan!A:A,0)),\"\")","v":""},{"$f":"IFERROR(INDEX(Feb!D:D,MATCH(Year!A:A,Feb!A:A,0)),\"\")","v":""},{"$f":"IFERROR(INDEX(March!D:D,MATCH(Year!A:A,March!A:A,0)),\"\")","v":""},{"$f":"IF(ISERROR((SUM(B110:M110))/B4),\"\",(SUM(B110:M110))/B4)","v":""}]
[{"$f":"IF(ISERROR('Audit questions'!A11),\"\",'Audit questions'!A11)","v":"Test10"},{"$f":"IFERROR(INDEX(April!D:D,MATCH(Year!A:A,April!A:A,0)),\"\")","v":""},{"$f":"IFERROR(INDEX(May!D:D,MATCH(Year!A:A,May!A:A,0)),\"\")","v":""},{"$f":"IFERROR(INDEX(June!D:D,MATCH(Year!A:A,June!A:A,0)),\"\")","v":""},{"$f":"IFERROR(INDEX(July!D:D,MATCH(Year!A:A,July!A:A,0)),\"\")","v":""},{"$f":"IFERROR(INDEX(Aug!D:D,MATCH(Year!A:A,Aug!A:A,0)),\"\")","v":""},{"$f":"IFERROR(INDEX(Sept!D:D,MATCH(Year!A:A,Sept!A:A,0)),\"\")","v":""},{"$f":"IFERROR(INDEX(Oct!D:D,MATCH(Year!A:A,Oct!A:A,0)),\"\")","v":""},{"$f":"IFERROR(INDEX(Nov!D:D,MATCH(Year!A:A,Nov!A:A,0)),\"\")","v":""},{"$f":"IFERROR(INDEX(Dec!D:D,MATCH(Year!A:A,Dec!A:A,0)),\"\")","v":""},{"$f":"IFERROR(INDEX(Jan!D:D,MATCH(Year!A:A,Jan!A:A,0)),\"\")","v":""},{"$f":"IFERROR(INDEX(Feb!D:D,MATCH(Year!A:A,Feb!A:A,0)),\"\")","v":""},{"$f":"IFERROR(INDEX(March!D:D,MATCH(Year!A:A,March!A:A,0)),\"\")","v":""},{"$f":"IF(ISERROR((SUM(B111:M111))/B4),\"\",(SUM(B111:M111))/B4)","v":""}]
[{"$f":"IF(ISERROR('Audit questions'!A12),\"\",'Audit questions'!A12)","v":"Test11"},{"$f":"IFERROR(INDEX(April!D:D,MATCH(Year!A:A,April!A:A,0)),\"\")","v":""},{"$f":"IFERROR(INDEX(May!D:D,MATCH(Year!A:A,May!A:A,0)),\"\")","v":""},{"$f":"IFERROR(INDEX(June!D:D,MATCH(Year!A:A,June!A:A,0)),\"\")","v":""},{"$f":"IFERROR(INDEX(July!D:D,MATCH(Year!A:A,July!A:A,0)),\"\")","v":""},{"$f":"IFERROR(INDEX(Aug!D:D,MATCH(Year!A:A,Aug!A:A,0)),\"\")","v":""},{"$f":"IFERROR(INDEX(Sept!D:D,MATCH(Year!A:A,Sept!A:A,0)),\"\")","v":""},{"$f":"IFERROR(INDEX(Oct!D:D,MATCH(Year!A:A,Oct!A:A,0)),\"\")","v":""},{"$f":"IFERROR(INDEX(Nov!D:D,MATCH(Year!A:A,Nov!A:A,0)),\"\")","v":""},{"$f":"IFERROR(INDEX(Dec!D:D,MATCH(Year!A:A,Dec!A:A,0)),\"\")","v":""},{"$f":"IFERROR(INDEX(Jan!D:D,MATCH(Year!A:A,Jan!A:A,0)),\"\")","v":""},{"$f":"IFERROR(INDEX(Feb!D:D,MATCH(Year!A:A,Feb!A:A,0)),\"\")","v":""},{"$f":"IFERROR(INDEX(March!D:D,MATCH(Year!A:A,March!A:A,0)),\"\")","v":""},{"$f":"IF(ISERROR((SUM(B112:M112))/B4),\"\",(SUM(B112:M112))/B4)","v":""}]
[{"$f":"IF(ISERROR('Audit questions'!A13),\"\",'Audit questions'!A13)","v":"Test12"},{"$f":"IFERROR(INDEX(April!D:D,MATCH(Year!A:A,April!A:A,0)),\"\")","v":""},{"$f":"IFERROR(INDEX(May!D:D,MATCH(Year!A:A,May!A:A,0)),\"\")","v":""},{"$f":"IFERROR(INDEX(June!D:D,MATCH(Year!A:A,June!A:A,0)),\"\")","v":""},{"$f":"IFERROR(INDEX(July!D:D,MATCH(Year!A:A,July!A:A,0)),\"\")","v":""},{"$f":"IFERROR(INDEX(Aug!D:D,MATCH(Year!A:A,Aug!A:A,0)),\"\")","v":""},{"$f":"IFERROR(INDEX(Sept!D:D,MATCH(Year!A:A,Sept!A:A,0)),\"\")","v":""},{"$f":"IFERROR(INDEX(Oct!D:D,MATCH(Year!A:A,Oct!A:A,0)),\"\")","v":""},{"$f":"IFERROR(INDEX(Nov!D:D,MATCH(Year!A:A,Nov!A:A,0)),\"\")","v":""},{"$f":"IFERROR(INDEX(Dec!D:D,MATCH(Year!A:A,Dec!A:A,0)),\"\")","v":""},{"$f":"IFERROR(INDEX(Jan!D:D,MATCH(Year!A:A,Jan!A:A,0)),\"\")","v":""},{"$f":"IFERROR(INDEX(Feb!D:D,MATCH(Year!A:A,Feb!A:A,0)),\"\")","v":""},{"$f":"IFERROR(INDEX(March!D:D,MATCH(Year!A:A,March!A:A,0)),\"\")","v":""},{"$f":"IF(ISERROR((SUM(B113:M113))/B4),\"\",(SUM(B113:M113))/B4)","v":""}]
[{"$f":"IF(ISERROR('Audit questions'!A14),\"\",'Audit questions'!A14)","v":"Test13"},{"$f":"IFERROR(INDEX(April!D:D,MATCH(Year!A:A,April!A:A,0)),\"\")","v":""},{"$f":"IFERROR(INDEX(May!D:D,MATCH(Year!A:A,May!A:A,0)),\"\")","v":""},{"$f":"IFERROR(INDEX(June!D:D,MATCH(Year!A:A,June!A:A,0)),\"\")","v":""},{"$f":"IFERROR(INDEX(July!D:D,MATCH(Year!A:A,July!A:A,0)),\"\")","v":""},{"$f":"IFERROR(INDEX(Aug!D:D,MATCH(Year!A:A,Aug!A:A,0)),\"\")","v":""},{"$f":"IFERROR(INDEX(Sept!D:D,MATCH(Year!A:A,Sept!A:A,0)),\"\")","v":""},{"$f":"IFERROR(INDEX(Oct!D:D,MATCH(Year!A:A,Oct!A:A,0)),\"\")","v":""},{"$f":"IFERROR(INDEX(Nov!D:D,MATCH(Year!A:A,Nov!A:A,0)),\"\")","v":""},{"$f":"IFERROR(INDEX(Dec!D:D,MATCH(Year!A:A,Dec!A:A,0)),\"\")","v":""},{"$f":"IFERROR(INDEX(Jan!D:D,MATCH(Year!A:A,Jan!A:A,0)),\"\")","v":""},{"$f":"IFERROR(INDEX(Feb!D:D,MATCH(Year!A:A,Feb!A:A,0)),\"\")","v":""},{"$f":"IFERROR(INDEX(March!D:D,MATCH(Year!A:A,March!A:A,0)),\"\")","v":""},{"$f":"IF(ISERROR((SUM(B114:M114))/B4),\"\",(SUM(B114:M114))/B4)","v":""}]
[{"$f":"IF(ISERROR('Audit questions'!A15),\"\",'Audit questions'!A15)","v":"Test14"},{"$f":"IFERROR(INDEX(April!D:D,MATCH(Year!A:A,April!A:A,0)),\"\")","v":""},{"$f":"IFERROR(INDEX(May!D:D,MATCH(Year!A:A,May!A:A,0)),\"\")","v":""},{"$f":"IFERROR(INDEX(June!D:D,MATCH(Year!A:A,June!A:A,0)),\"\")","v":""},{"$f":"IFERROR(INDEX(July!D:D,MATCH(Year!A:A,July!A:A,0)),\"\")","v":""},{"$f":"IFERROR(INDEX(Aug!D:D,MATCH(Year!A:A,Aug!A:A,0)),\"\")","v":""},{"$f":"IFERROR(INDEX(Sept!D:D,MATCH(Year!A:A,Sept!A:A,0)),\"\")","v":""},{"$f":"IFERROR(INDEX(Oct!D:D,MATCH(Year!A:A,Oct!A:A,0)),\"\")","v":""},{"$f":"IFERROR(INDEX(Nov!D:D,MATCH(Year!A:A,Nov!A:A,0)),\"\")","v":""},{"$f":"IFERROR(INDEX(Dec!D:D,MATCH(Year!A:A,Dec!A:A,0)),\"\")","v":""},{"$f":"IFERROR(INDEX(Jan!D:D,MATCH(Year!A:A,Jan!A:A,0)),\"\")","v":""},{"$f":"IFERROR(INDEX(Feb!D:D,MATCH(Year!A:A,Feb!A:A,0)),\"\")","v":""},{"$f":"IFERROR(INDEX(March!D:D,MATCH(Year!A:A,March!A:A,0)),\"\")","v":""},{"$f":"IF(ISERROR((SUM(B115:M115))/B4),\"\",(SUM(B115:M115))/B4)","v":""}]
[{"$f":"IF(ISERROR('Audit questions'!A16),\"\",'Audit questions'!A16)","v":"Test15"},{"$f":"IFERROR(INDEX(April!D:D,MATCH(Year!A:A,April!A:A,0)),\"\")","v":""},{"$f":"IFERROR(INDEX(May!D:D,MATCH(Year!A:A,May!A:A,0)),\"\")","v":""},{"$f":"IFERROR(INDEX(June!D:D,MATCH(Year!A:A,June!A:A,0)),\"\")","v":""},{"$f":"IFERROR(INDEX(July!D:D,MATCH(Year!A:A,July!A:A,0)),\"\")","v":""},{"$f":"IFERROR(INDEX(Aug!D:D,MATCH(Year!A:A,Aug!A:A,0)),\"\")","v":""},{"$f":"IFERROR(INDEX(Sept!D:D,MATCH(Year!A:A,Sept!A:A,0)),\"\")","v":""},{"$f":"IFERROR(INDEX(Oct!D:D,MATCH(Year!A:A,Oct!A:A,0)),\"\")","v":""},{"$f":"IFERROR(INDEX(Nov!D:D,MATCH(Year!A:A,Nov!A:A,0)),\"\")","v":""},{"$f":"IFERROR(INDEX(Dec!D:D,MATCH(Year!A:A,Dec!A:A,0)),\"\")","v":""},{"$f":"IFERROR(INDEX(Jan!D:D,MATCH(Year!A:A,Jan!A:A,0)),\"\")","v":""},{"$f":"IFERROR(INDEX(Feb!D:D,MATCH(Year!A:A,Feb!A:A,0)),\"\")","v":""},{"$f":"IFERROR(INDEX(March!D:D,MATCH(Year!A:A,March!A:A,0)),\"\")","v":""},{"$f":"IF(ISERROR((SUM(B116:M116))/B4),\"\",(SUM(B116:M116))/B4)","v":""}]
[{"$f":"IF(ISERROR('Audit questions'!A17),\"\",'Audit questions'!A17)","v":"Test16"},{"$f":"IFERROR(INDEX(April!D:D,MATCH(Year!A:A,April!A:A,0)),\"\")","v":""},{"$f":"IFERROR(INDEX(May!D:D,MATCH(Year!A:A,May!A:A,0)),\"\")","v":""},{"$f":"IFERROR(INDEX(June!D:D,MATCH(Year!A:A,June!A:A,0)),\"\")","v":""},{"$f":"IFERROR(INDEX(July!D:D,MATCH(Year!A:A,July!A:A,0)),\"\")","v":""},{"$f":"IFERROR(INDEX(Aug!D:D,MATCH(Year!A:A,Aug!A:A,0)),\"\")","v":""},{"$f":"IFERROR(INDEX(Sept!D:D,MATCH(Year!A:A,Sept!A:A,0)),\"\")","v":""},{"$f":"IFERROR(INDEX(Oct!D:D,MATCH(Year!A:A,Oct!A:A,0)),\"\")","v":""},{"$f":"IFERROR(INDEX(Nov!D:D,MATCH(Year!A:A,Nov!A:A,0)),\"\")","v":""},{"$f":"IFERROR(INDEX(Dec!D:D,MATCH(Year!A:A,Dec!A:A,0)),\"\")","v":""},{"$f":"IFERROR(INDEX(Jan!D:D,MATCH(Year!A:A,Jan!A:A,0)),\"\")","v":""},{"$f":"IFERROR(INDEX(Feb!D:D,MATCH(Year!A:A,Feb!A:A,0)),\"\")","v":""},{"$f":"IFERROR(INDEX(March!D:D,MATCH(Year!A:A,March!A:A,0)),\"\")","v":""},{"$f":"IF(ISERROR((SUM(B117:M117))/B4),\"\",(SUM(B117:M117))/B4)","v":""}]
[{"$f":"IF(ISERROR('Audit questions'!A18),\"\",'Audit questions'!A18)","v":"Test17"},{"$f":"IFERROR(INDEX(April!D:D,MATCH(Year!A:A,April!A:A,0)),\"\")","v":""},{"$f":"IFERROR(INDEX(May!D:D,MATCH(Year!A:A,May!A:A,0)),\"\")","v":""},{"$f":"IFERROR(INDEX(June!D:D,MATCH(Year!A:A,June!A:A,0)),\"\")","v":""},{"$f":"IFERROR(INDEX(July!D:D,MATCH(Year!A:A,July!A:A,0)),\"\")","v":""},{"$f":"IFERROR(INDEX(Aug!D:D,MATCH(Year!A:A,Aug!A:A,0)),\"\")","v":""},{"$f":"IFERROR(INDEX(Sept!D:D,MATCH(Year!A:A,Sept!A:A,0)),\"\")","v":""},{"$f":"IFERROR(INDEX(Oct!D:D,MATCH(Year!A:A,Oct!A:A,0)),\"\")","v":""},{"$f":"IFERROR(INDEX(Nov!D:D,MATCH(Year!A:A,Nov!A:A,0)),\"\")","v":""},{"$f":"IFERROR(INDEX(Dec!D:D,MATCH(Year!A:A,Dec!A:A,0)),\"\")","v":""},{"$f":"IFERROR(INDEX(Jan!D:D,MATCH(Year!A:A,Jan!A:A,0)),\"\")","v":""},{"$f":"IFERROR(INDEX(Feb!D:D,MATCH(Year!A:A,Feb!A:A,0)),\"\")","v":""},{"$f":"IFERROR(INDEX(March!D:D,MATCH(Year!A:A,March!A:A,0)),\"\")","v":""},{"$f":"IF(ISERROR((SUM(B118:M118))/B4),\"\",(SUM(B118:M118))/B4)","v":""}]
[{"$f":"IF(ISERROR('Audit questions'!A19),\"\",'Audit questions'!A19)","v":"Test18"},{"$f":"IFERROR(INDEX(April!D:D,MATCH(Year!A:A,April!A:A,0)),\"\")","v":""},{"$f":"IFERROR(INDEX(May!D:D,MATCH(Year!A:A,May!A:A,0)),\"\")","v":""},{"$f":"IFERROR(INDEX(June!D:D,MATCH(Year!A:A,June!A:A,0)),\"\")","v":""},{"$f":"IFERROR(INDEX(July!D:D,MATCH(Year!A:A,July!A:A,0)),\"\")","v":""},{"$f":"IFERROR(INDEX(Aug!D:D,MATCH(Year!A:A,Aug!A:A,0)),\"\")","v":""},{"$f":"IFERROR(INDEX(Sept!D:D,MATCH(Year!A:A,Sept!A:A,0)),\"\")","v":""},{"$f":"IFERROR(INDEX(Oct!D:D,MATCH(Year!A:A,Oct!A:A,0)),\"\")","v":""},{"$f":"IFERROR(INDEX(Nov!D:D,MATCH(Year!A:A,Nov!A:A,0)),\"\")","v":""},{"$f":"IFERROR(INDEX(Dec!D:D,MATCH(Year!A:A,Dec!A:A,0)),\"\")","v":""},{"$f":"IFERROR(INDEX(Jan!D:D,MATCH(Year!A:A,Jan!A:A,0)),\"\")","v":""},{"$f":"IFERROR(INDEX(Feb!D:D,MATCH(Year!A:A,Feb!A:A,0)),\"\")","v":""},{"$f":"IFERROR(INDEX(March!D:D,MATCH(Year!A:A,March!A:A,0)),\"\")","v":""},{"$f":"IF(ISERROR((SUM(B119:M119))/B4),\"\",(SUM(B119:M119))/B4)","v":""}]
[{"$f":"IF(ISERROR('Audit questions'!A20),\"\",'Audit questions'!A20)","v":"Test19"},{"$f":"IFERROR(INDEX(April!D:D,MATCH(Year!A:A,April!A:A,0)),\"\")","v":""},{"$f":"IFERROR(INDEX(May!D:D,MATCH(Year!A:A,May!A:A,0)),\"\")","v":""},{"$f":"IFERROR(INDEX(June!D:D,MATCH(Year!A:A,June!A:A,0)),\"\")","v":""},{"$f":"IFERROR(INDEX(July!D:D,MATCH(Year!A:A,July!A:A,0)),\"\")","v":""},{"$f":"IFERROR(INDEX(Aug!D:D,MATCH(Year!A:A,Aug!A:A,0)),\"\")","v":""},{"$f":"IFERROR(INDEX(Sept!D:D,MATCH(Year!A:A,Sept!A:A,0)),\"\")","v":""},{"$f":"IFERROR(INDEX(Oct!D:D,MATCH(Year!A:A,Oct!A:A,0)),\"\")","v":""},{"$f":"IFERROR(INDEX(Nov!D:D,MATCH(Year!A:A,Nov!A:A,0)),\"\")","v":""},{"$f":"IFERROR(INDEX(Dec!D:D,MATCH(Year!A:A,Dec!A:A,0)),\"\")","v":""},{"$f":"IFERROR(INDEX(Jan!D:D,MATCH(Year!A:A,Jan!A:A,0)),\"\")","v":""},{"$f":"IFERROR(INDEX(Feb!D:D,MATCH(Year!A:A,Feb!A:A,0)),\"\")","v":""},{"$f":"IFERROR(INDEX(March!D:D,MATCH(Year!A:A,March!A:A,0)),\"\")","v":""},{"$f":"IF(ISERROR((SUM(B120:M120))/B4),\"\",(SUM(B120:M120))/B4)","v":""}]
[{"$f":"IF(ISERROR('Audit questions'!A21),\"\",'Audit questions'!A21)","v":"Test20"},{"$f":"IFERROR(INDEX(April!D:D,MATCH(Year!A:A,April!A:A,0)),\"\")","v":""},{"$f":"IFERROR(INDEX(May!D:D,MATCH(Year!A:A,May!A:A,0)),\"\")","v":""},{"$f":"IFERROR(INDEX(June!D:D,MATCH(Year!A:A,June!A:A,0)),\"\")","v":""},{"$f":"IFERROR(INDEX(July!D:D,MATCH(Year!A:A,July!A:A,0)),\"\")","v":""},{"$f":"IFERROR(INDEX(Aug!D:D,MATCH(Year!A:A,Aug!A:A,0)),\"\")","v":""},{"$f":"IFERROR(INDEX(Sept!D:D,MATCH(Year!A:A,Sept!A:A,0)),\"\")","v":""},{"$f":"IFERROR(INDEX(Oct!D:D,MATCH(Year!A:A,Oct!A:A,0)),\"\")","v":""},{"$f":"IFERROR(INDEX(Nov!D:D,MATCH(Year!A:A,Nov!A:A,0)),\"\")","v":""},{"$f":"IFERROR(INDEX(Dec!D:D,MATCH(Year!A:A,Dec!A:A,0)),\"\")","v":""},{"$f":"IFERROR(INDEX(Jan!D:D,MATCH(Year!A:A,Jan!A:A,0)),\"\")","v":""},{"$f":"IFERROR(INDEX(Feb!D:D,MATCH(Year!A:A,Feb!A:A,0)),\"\")","v":""},{"$f":"IFERROR(INDEX(March!D:D,MATCH(Year!A:A,March!A:A,0)),\"\")","v":""},{"$f":"IF(ISERROR((SUM(B121:M121))/B4),\"\",(SUM(B121:M121))/B4)","v":""}]
[{"$f":"IF(ISERROR('Audit questions'!A22),\"\",'Audit questions'!A22)","v":"Test21"},{"$f":"IFERROR(INDEX(April!D:D,MATCH(Year!A:A,April!A:A,0)),\"\")","v":""},{"$f":"IFERROR(INDEX(May!D:D,MATCH(Year!A:A,May!A:A,0)),\"\")","v":""},{"$f":"IFERROR(INDEX(June!D:D,MATCH(Year!A:A,June!A:A,0)),\"\")","v":""},{"$f":"IFERROR(INDEX(July!D:D,MATCH(Year!A:A,July!A:A,0)),\"\")","v":""},{"$f":"IFERROR(INDEX(Aug!D:D,MATCH(Year!A:A,Aug!A:A,0)),\"\")","v":""},{"$f":"IFERROR(INDEX(Sept!D:D,MATCH(Year!A:A,Sept!A:A,0)),\"\")","v":""},{"$f":"IFERROR(INDEX(Oct!D:D,MATCH(Year!A:A,Oct!A:A,0)),\"\")","v":""},{"$f":"IFERROR(INDEX(Nov!D:D,MATCH(Year!A:A,Nov!A:A,0)),\"\")","v":""},{"$f":"IFERROR(INDEX(Dec!D:D,MATCH(Year!A:A,Dec!A:A,0)),\"\")","v":""},{"$f":"IFERROR(INDEX(Jan!D:D,MATCH(Year!A:A,Jan!A:A,0)),\"\")","v":""},{"$f":"IFERROR(INDEX(Feb!D:D,MATCH(Year!A:A,Feb!A:A,0)),\"\")","v":""},{"$f":"IFERROR(INDEX(March!D:D,MATCH(Year!A:A,March!A:A,0)),\"\")","v":""},{"$f":"IF(ISERROR((SUM(B122:M122))/B4),\"\",(SUM(B122:M122))/B4)","v":""}]
[{"$f":"IF(ISERROR('Audit questions'!A23),\"\",'Audit questions'!A23)","v":"Test22"},{"$f":"IFERROR(INDEX(April!D:D,MATCH(Year!A:A,April!A:A,0)),\"\")","v":""},{"$f":"IFERROR(INDEX(May!D:D,MATCH(Year!A:A,May!A:A,0)),\"\")","v":""},{"$f":"IFERROR(INDEX(June!D:D,MATCH(Year!A:A,June!A:A,0)),\"\")","v":""},{"$f":"IFERROR(INDEX(July!D:D,MATCH(Year!A:A,July!A:A,0)),\"\")","v":""},{"$f":"IFERROR(INDEX(Aug!D:D,MATCH(Year!A:A,Aug!A:A,0)),\"\")","v":""},{"$f":"IFERROR(INDEX(Sept!D:D,MATCH(Year!A:A,Sept!A:A,0)),\"\")","v":""},{"$f":"IFERROR(INDEX(Oct!D:D,MATCH(Year!A:A,Oct!A:A,0)),\"\")","v":""},{"$f":"IFERROR(INDEX(Nov!D:D,MATCH(Year!A:A,Nov!A:A,0)),\"\")","v":""},{"$f":"IFERROR(INDEX(Dec!D:D,MATCH(Year!A:A,Dec!A:A,0)),\"\")","v":""},{"$f":"IFERROR(INDEX(Jan!D:D,MATCH(Year!A:A,Jan!A:A,0)),\"\")","v":""},{"$f":"IFERROR(INDEX(Feb!D:D,MATCH(Year!A:A,Feb!A:A,0)),\"\")","v":""},{"$f":"IFERROR(INDEX(March!D:D,MATCH(Year!A:A,March!A:A,0)),\"\")","v":""},{"$f":"IF(ISERROR((SUM(B123:M123))/B4),\"\",(SUM(B123:M123))/B4)","v":""}]
[{"$f":"IF(ISERROR('Audit questions'!A24),\"\",'Audit questions'!A24)","v":"Test23"},{"$f":"IFERROR(INDEX(April!D:D,MATCH(Year!A:A,April!A:A,0)),\"\")","v":""},{"$f":"IFERROR(INDEX(May!D:D,MATCH(Year!A:A,May!A:A,0)),\"\")","v":""},{"$f":"IFERROR(INDEX(June!D:D,MATCH(Year!A:A,June!A:A,0)),\"\")","v":""},{"$f":"IFERROR(INDEX(July!D:D,MATCH(Year!A:A,July!A:A,0)),\"\")","v":""},{"$f":"IFERROR(INDEX(Aug!D:D,MATCH(Year!A:A,Aug!A:A,0)),\"\")","v":""},{"$f":"IFERROR(INDEX(Sept!D:D,MATCH(Year!A:A,Sept!A:A,0)),\"\")","v":""},{"$f":"IFERROR(INDEX(Oct!D:D,MATCH(Year!A:A,Oct!A:A,0)),\"\")","v":""},{"$f":"IFERROR(INDEX(Nov!D:D,MATCH(Year!A:A,Nov!A:A,0)),\"\")","v":""},{"$f":"IFERROR(INDEX(Dec!D:D,MATCH(Year!A:A,Dec!A:A,0)),\"\")","v":""},{"$f":"IFERROR(INDEX(Jan!D:D,MATCH(Year!A:A,Jan!A:A,0)),\"\")","v":""},{"$f":"IFERROR(INDEX(Feb!D:D,MATCH(Year!A:A,Feb!A:A,0)),\"\")","v":""},{"$f":"IFERROR(INDEX(March!D:D,MATCH(Year!A:A,March!A:A,0)),\"\")","v":""},{"$f":"IF(ISERROR((SUM(B124:M124))/B4),\"\",(SUM(B124:M124))/B4)","v":""}]
[{"$f":"IF(ISERROR('Audit questions'!A25),\"\",'Audit questions'!A25)","v":"Test24"},{"$f":"IFERROR(INDEX(April!D:D,MATCH(Year!A:A,April!A:A,0)),\"\")","v":""},{"$f":"IFERROR(INDEX(May!D:D,MATCH(Year!A:A,May!A:A,0)),\"\")","v":""},{"$f":"IFERROR(INDEX(June!D:D,MATCH(Year!A:A,June!A:A,0)),\"\")","v":""},{"$f":"IFERROR(INDEX(July!D:D,MATCH(Year!A:A,July!A:A,0)),\"\")","v":""},{"$f":"IFERROR(INDEX(Aug!D:D,MATCH(Year!A:A,Aug!A:A,0)),\"\")","v":""},{"$f":"IFERROR(INDEX(Sept!D:D,MATCH(Year!A:A,Sept!A:A,0)),\"\")","v":""},{"$f":"IFERROR(INDEX(Oct!D:D,MATCH(Year!A:A,Oct!A:A,0)),\"\")","v":""},{"$f":"IFERROR(INDEX(Nov!D:D,MATCH(Year!A:A,Nov!A:A,0)),\"\")","v":""},{"$f":"IFERROR(INDEX(Dec!D:D,MATCH(Year!A:A,Dec!A:A,0)),\"\")","v":""},{"$f":"IFERROR(INDEX(Jan!D:D,MATCH(Year!A:A,Jan!A:A,0)),\"\")","v":""},{"$f":"IFERROR(INDEX(Feb!D:D,MATCH(Year!A:A,Feb!A:A,0)),\"\")","v":""},{"$f":"IFERROR(INDEX(March!D:D,MATCH(Year!A:A,March!A:A,0)),\"\")","v":""},{"$f":"IF(ISERROR((SUM(B125:M125))/B4),\"\",(SUM(B125:M125))/B4)","v":""}]
[{"$f":"IF(ISERROR('Audit questions'!A26),\"\",'Audit questions'!A26)","v":"Test25"},{"$f":"IFERROR(INDEX(April!D:D,MATCH(Year!A:A,April!A:A,0)),\"\")","v":""},{"$f":"IFERROR(INDEX(May!D:D,MATCH(Year!A:A,May!A:A,0)),\"\")","v":""},{"$f":"IFERROR(INDEX(June!D:D,MATCH(Year!A:A,June!A:A,0)),\"\")","v":""},{"$f":"IFERROR(INDEX(July!D:D,MATCH(Year!A:A,July!A:A,0)),\"\")","v":""},{"$f":"IFERROR(INDEX(Aug!D:D,MATCH(Year!A:A,Aug!A:A,0)),\"\")","v":""},{"$f":"IFERROR(INDEX(Sept!D:D,MATCH(Year!A:A,Sept!A:A,0)),\"\")","v":""},{"$f":"IFERROR(INDEX(Oct!D:D,MATCH(Year!A:A,Oct!A:A,0)),\"\")","v":""},{"$f":"IFERROR(INDEX(Nov!D:D,MATCH(Year!A:A,Nov!A:A,0)),\"\")","v":""},{"$f":"IFERROR(INDEX(Dec!D:D,MATCH(Year!A:A,Dec!A:A,0)),\"\")","v":""},{"$f":"IFERROR(INDEX(Jan!D:D,MATCH(Year!A:A,Jan!A:A,0)),\"\")","v":""},{"$f":"IFERROR(INDEX(Feb!D:D,MATCH(Year!A:A,Feb!A:A,0)),\"\")","v":""},{"$f":"IFERROR(INDEX(March!D:D,MATCH(Year!A:A,March!A:A,0)),\"\")","v":""},{"$f":"IF(ISERROR((SUM(B126:M126))/B4),\"\",(SUM(B126:M126))/B4)","v":""}]
[{"$f":"IF(ISERROR('Audit questions'!A27),\"\",'Audit questions'!A27)","v":"Test26"},{"$f":"IFERROR(INDEX(April!D:D,MATCH(Year!A:A,April!A:A,0)),\"\")","v":""},{"$f":"IFERROR(INDEX(May!D:D,MATCH(Year!A:A,May!A:A,0)),\"\")","v":""},{"$f":"IFERROR(INDEX(June!D:D,MATCH(Year!A:A,June!A:A,0)),\"\")","v":""},{"$f":"IFERROR(INDEX(July!D:D,MATCH(Year!A:A,July!A:A,0)),\"\")","v":""},{"$f":"IFERROR(INDEX(Aug!D:D,MATCH(Year!A:A,Aug!A:A,0)),\"\")","v":""},{"$f":"IFERROR(INDEX(Sept!D:D,MATCH(Year!A:A,Sept!A:A,0)),\"\")","v":""},{"$f":"IFERROR(INDEX(Oct!D:D,MATCH(Year!A:A,Oct!A:A,0)),\"\")","v":""},{"$f":"IFERROR(INDEX(Nov!D:D,MATCH(Year!A:A,Nov!A:A,0)),\"\")","v":""},{"$f":"IFERROR(INDEX(Dec!D:D,MATCH(Year!A:A,Dec!A:A,0)),\"\")","v":""},{"$f":"IFERROR(INDEX(Jan!D:D,MATCH(Year!A:A,Jan!A:A,0)),\"\")","v":""},{"$f":"IFERROR(INDEX(Feb!D:D,MATCH(Year!A:A,Feb!A:A,0)),\"\")","v":""},{"$f":"IFERROR(INDEX(March!D:D,MATCH(Year!A:A,March!A:A,0)),\"\")","v":""},{"$f":"IF(ISERROR((SUM(B127:M127))/B4),\"\",(SUM(B127:M127))/B4)","v":""}]
[{"$f":"IF(ISERROR('Audit questions'!A28),\"\",'Audit questions'!A28)","v":"Test27"},{"$f":"IFERROR(INDEX(April!D:D,MATCH(Year!A:A,April!A:A,0)),\"\")","v":""},{"$f":"IFERROR(INDEX(May!D:D,MATCH(Year!A:A,May!A:A,0)),\"\")","v":""},{"$f":"IFERROR(INDEX(June!D:D,MATCH(Year!A:A,June!A:A,0)),\"\")","v":""},{"$f":"IFERROR(INDEX(July!D:D,MATCH(Year!A:A,July!A:A,0)),\"\")","v":""},{"$f":"IFERROR(INDEX(Aug!D:D,MATCH(Year!A:A,Aug!A:A,0)),\"\")","v":""},{"$f":"IFERROR(INDEX(Sept!D:D,MATCH(Year!A:A,Sept!A:A,0)),\"\")","v":""},{"$f":"IFERROR(INDEX(Oct!D:D,MATCH(Year!A:A,Oct!A:A,0)),\"\")","v":""},{"$f":"IFERROR(INDEX(Nov!D:D,MATCH(Year!A:A,Nov!A:A,0)),\"\")","v":""},{"$f":"IFERROR(INDEX(Dec!D:D,MATCH(Year!A:A,Dec!A:A,0)),\"\")","v":""},{"$f":"IFERROR(INDEX(Jan!D:D,MATCH(Year!A:A,Jan!A:A,0)),\"\")","v":""},{"$f":"IFERROR(INDEX(Feb!D:D,MATCH(Year!A:A,Feb!A:A,0)),\"\")","v":""},{"$f":"IFERROR(INDEX(March!D:D,MATCH(Year!A:A,March!A:A,0)),\"\")","v":""},{"$f":"IF(ISERROR((SUM(B128:M128))/B4),\"\",(SUM(B128:M128))/B4)","v":""}]
[{"$f":"IF(ISERROR('Audit questions'!A29),\"\",'Audit questions'!A29)","v":"Test28"},{"$f":"IFERROR(INDEX(April!D:D,MATCH(Year!A:A,April!A:A,0)),\"\")","v":""},{"$f":"IFERROR(INDEX(May!D:D,MATCH(Year!A:A,May!A:A,0)),\"\")","v":""},{"$f":"IFERROR(INDEX(June!D:D,MATCH(Year!A:A,June!A:A,0)),\"\")","v":""},{"$f":"IFERROR(INDEX(July!D:D,MATCH(Year!A:A,July!A:A,0)),\"\")","v":""},{"$f":"IFERROR(INDEX(Aug!D:D,MATCH(Year!A:A,Aug!A:A,0)),\"\")","v":""},{"$f":"IFERROR(INDEX(Sept!D:D,MATCH(Year!A:A,Sept!A:A,0)),\"\")","v":""},{"$f":"IFERROR(INDEX(Oct!D:D,MATCH(Year!A:A,Oct!A:A,0)),\"\")","v":""},{"$f":"IFERROR(INDEX(Nov!D:D,MATCH(Year!A:A,Nov!A:A,0)),\"\")","v":""},{"$f":"IFERROR(INDEX(Dec!D:D,MATCH(Year!A:A,Dec!A:A,0)),\"\")","v":""},{"$f":"IFERROR(INDEX(Jan!D:D,MATCH(Year!A:A,Jan!A:A,0)),\"\")","v":""},{"$f":"IFERROR(INDEX(Feb!D:D,MATCH(Year!A:A,Feb!A:A,0)),\"\")","v":""},{"$f":"IFERROR(INDEX(March!D:D,MATCH(Year!A:A,March!A:A,0)),\"\")","v":""},{"$f":"IF(ISERROR((SUM(B129:M129))/B4),\"\",(SUM(B129:M129))/B4)","v":""}]
[{"$f":"IF(ISERROR('Audit questions'!A30),\"\",'Audit questions'!A30)","v":"Test29"},{"$f":"IFERROR(INDEX(April!D:D,MATCH(Year!A:A,April!A:A,0)),\"\")","v":""},{"$f":"IFERROR(INDEX(May!D:D,MATCH(Year!A:A,May!A:A,0)),\"\")","v":""},{"$f":"IFERROR(INDEX(June!D:D,MATCH(Year!A:A,June!A:A,0)),\"\")","v":""},{"$f":"IFERROR(INDEX(July!D:D,MATCH(Year!A:A,July!A:A,0)),\"\")","v":""},{"$f":"IFERROR(INDEX(Aug!D:D,MATCH(Year!A:A,Aug!A:A,0)),\"\")","v":""},{"$f":"IFERROR(INDEX(Sept!D:D,MATCH(Year!A:A,Sept!A:A,0)),\"\")","v":""},{"$f":"IFERROR(INDEX(Oct!D:D,MATCH(Year!A:A,Oct!A:A,0)),\"\")","v":""},{"$f":"IFERROR(INDEX(Nov!D:D,MATCH(Year!A:A,Nov!A:A,0)),\"\")","v":""},{"$f":"IFERROR(INDEX(Dec!D:D,MATCH(Year!A:A,Dec!A:A,0)),\"\")","v":""},{"$f":"IFERROR(INDEX(Jan!D:D,MATCH(Year!A:A,Jan!A:A,0)),\"\")","v":""},{"$f":"IFERROR(INDEX(Feb!D:D,MATCH(Year!A:A,Feb!A:A,0)),\"\")","v":""},{"$f":"IFERROR(INDEX(March!D:D,MATCH(Year!A:A,March!A:A,0)),\"\")","v":""},{"$f":"IF(ISERROR((SUM(B130:M130))/B4),\"\",(SUM(B130:M130))/B4)","v":""}]
[{"$f":"IF(ISERROR('Audit questions'!A31),\"\",'Audit questions'!A31)","v":"Test30"},{"$f":"IFERROR(INDEX(April!D:D,MATCH(Year!A:A,April!A:A,0)),\"\")","v":""},{"$f":"IFERROR(INDEX(May!D:D,MATCH(Year!A:A,May!A:A,0)),\"\")","v":""},{"$f":"IFERROR(INDEX(June!D:D,MATCH(Year!A:A,June!A:A,0)),\"\")","v":""},{"$f":"IFERROR(INDEX(July!D:D,MATCH(Year!A:A,July!A:A,0)),\"\")","v":""},{"$f":"IFERROR(INDEX(Aug!D:D,MATCH(Year!A:A,Aug!A:A,0)),\"\")","v":""},{"$f":"IFERROR(INDEX(Sept!D:D,MATCH(Year!A:A,Sept!A:A,0)),\"\")","v":""},{"$f":"IFERROR(INDEX(Oct!D:D,MATCH(Year!A:A,Oct!A:A,0)),\"\")","v":""},{"$f":"IFERROR(INDEX(Nov!D:D,MATCH(Year!A:A,Nov!A:A,0)),\"\")","v":""},{"$f":"IFERROR(INDEX(Dec!D:D,MATCH(Year!A:A,Dec!A:A,0)),\"\")","v":""},{"$f":"IFERROR(INDEX(Jan!D:D,MATCH(Year!A:A,Jan!A:A,0)),\"\")","v":""},{"$f":"IFERROR(INDEX(Feb!D:D,MATCH(Year!A:A,Feb!A:A,0)),\"\")","v":""},{"$f":"IFERROR(INDEX(March!D:D,MATCH(Year!A:A,March!A:A,0)),\"\")","v":""},{"$f":"IF(ISERROR((SUM(B131:M131))/B4),\"\",(SUM(B131:M131))/B4)","v":""}]
[{"$f":"IF(ISERROR('Audit questions'!A32),\"\",'Audit questions'!A32)","v":"Test31"},{"$f":"IFERROR(INDEX(April!D:D,MATCH(Year!A:A,April!A:A,0)),\"\")","v":""},{"$f":"IFERROR(INDEX(May!D:D,MATCH(Year!A:A,May!A:A,0)),\"\")","v":""},{"$f":"IFERROR(INDEX(June!D:D,MATCH(Year!A:A,June!A:A,0)),\"\")","v":""},{"$f":"IFERROR(INDEX(July!D:D,MATCH(Year!A:A,July!A:A,0)),\"\")","v":""},{"$f":"IFERROR(INDEX(Aug!D:D,MATCH(Year!A:A,Aug!A:A,0)),\"\")","v":""},{"$f":"IFERROR(INDEX(Sept!D:D,MATCH(Year!A:A,Sept!A:A,0)),\"\")","v":""},{"$f":"IFERROR(INDEX(Oct!D:D,MATCH(Year!A:A,Oct!A:A,0)),\"\")","v":""},{"$f":"IFERROR(INDEX(Nov!D:D,MATCH(Year!A:A,Nov!A:A,0)),\"\")","v":""},{"$f":"IFERROR(INDEX(Dec!D:D,MATCH(Year!A:A,Dec!A:A,0)),\"\")","v":""},{"$f":"IFERROR(INDEX(Jan!D:D,MATCH(Year!A:A,Jan!A:A,0)),\"\")","v":""},{"$f":"IFERROR(INDEX(Feb!D:D,MATCH(Year!A:A,Feb!A:A,0)),\"\")","v":""},{"$f":"IFERROR(INDEX(March!D:D,MATCH(Year!A:A,March!A:A,0)),\"\")","v":""},{"$f":"IF(ISERROR((SUM(B132:M132))/B4),\"\",(SUM(B132:M132))/B4)","v":""}]
[{"$f":"IF(ISERROR('Audit questions'!A33),\"\",'Audit questions'!A33)","v":"Test32"},{"$f":"IFERROR(INDEX(April!D:D,MATCH(Year!A:A,April!A:A,0)),\"\")","v":""},{"$f":"IFERROR(INDEX(May!D:D,MATCH(Year!A:A,May!A:A,0)),\"\")","v":""},{"$f":"IFERROR(INDEX(June!D:D,MATCH(Year!A:A,June!A:A,0)),\"\")","v":""},{"$f":"IFERROR(INDEX(July!D:D,MATCH(Year!A:A,July!A:A,0)),\"\")","v":""},{"$f":"IFERROR(INDEX(Aug!D:D,MATCH(Year!A:A,Aug!A:A,0)),\"\")","v":""},{"$f":"IFERROR(INDEX(Sept!D:D,MATCH(Year!A:A,Sept!A:A,0)),\"\")","v":""},{"$f":"IFERROR(INDEX(Oct!D:D,MATCH(Year!A:A,Oct!A:A,0)),\"\")","v":""},{"$f":"IFERROR(INDEX(Nov!D:D,MATCH(Year!A:A,Nov!A:A,0)),\"\")","v":""},{"$f":"IFERROR(INDEX(Dec!D:D,MATCH(Year!A:A,Dec!A:A,0)),\"\")","v":""},{"$f":"IFERROR(INDEX(Jan!D:D,MATCH(Year!A:A,Jan!A:A,0)),\"\")","v":""},{"$f":"IFERROR(INDEX(Feb!D:D,MATCH(Year!A:A,Feb!A:A,0)),\"\")","v":""},{"$f":"IFERROR(INDEX(March!D:D,MATCH(Year!A:A,March!A:A,0)),\"\")","v":""},{"$f":"IF(ISERROR((SUM(B133:M133))/B4),\"\",(SUM(B133:M133))/B4)","v":""}]
[{"$f":"IF(ISERROR('Audit questions'!A34),\"\",'Audit questions'!A34)","v":"Test33"},{"$f":"IFERROR(INDEX(April!D:D,MATCH(Year!A:A,April!A:A,0)),\"\")","v":""},{"$f":"IFERROR(INDEX(May!D:D,MATCH(Year!A:A,May!A:A,0)),\"\")","v":""},{"$f":"IFERROR(INDEX(June!D:D,MATCH(Year!A:A,June!A:A,0)),\"\")","v":""},{"$f":"IFERROR(INDEX(July!D:D,MATCH(Year!A:A,July!A:A,0)),\"\")","v":""},{"$f":"IFERROR(INDEX(Aug!D:D,MATCH(Year!A:A,Aug!A:A,0)),\"\")","v":""},{"$f":"IFERROR(INDEX(Sept!D:D,MATCH(Year!A:A,Sept!A:A,0)),\"\")","v":""},{"$f":"IFERROR(INDEX(Oct!D:D,MATCH(Year!A:A,Oct!A:A,0)),\"\")","v":""},{"$f":"IFERROR(INDEX(Nov!D:D,MATCH(Year!A:A,Nov!A:A,0)),\"\")","v":""},{"$f":"IFERROR(INDEX(Dec!D:D,MATCH(Year!A:A,Dec!A:A,0)),\"\")","v":""},{"$f":"IFERROR(INDEX(Jan!D:D,MATCH(Year!A:A,Jan!A:A,0)),\"\")","v":""},{"$f":"IFERROR(INDEX(Feb!D:D,MATCH(Year!A:A,Feb!A:A,0)),\"\")","v":""},{"$f":"IFERROR(INDEX(March!D:D,MATCH(Year!A:A,March!A:A,0)),\"\")","v":""},{"$f":"IF(ISERROR((SUM(B134:M134))/B4),\"\",(SUM(B134:M134))/B4)","v":""}]
[{"$f":"IF(ISERROR('Audit questions'!A35),\"\",'Audit questions'!A35)","v":"Test34"},{"$f":"IFERROR(INDEX(April!D:D,MATCH(Year!A:A,April!A:A,0)),\"\")","v":""},{"$f":"IFERROR(INDEX(May!D:D,MATCH(Year!A:A,May!A:A,0)),\"\")","v":""},{"$f":"IFERROR(INDEX(June!D:D,MATCH(Year!A:A,June!A:A,0)),\"\")","v":""},{"$f":"IFERROR(INDEX(July!D:D,MATCH(Year!A:A,July!A:A,0)),\"\")","v":""},{"$f":"IFERROR(INDEX(Aug!D:D,MATCH(Year!A:A,Aug!A:A,0)),\"\")","v":""},{"$f":"IFERROR(INDEX(Sept!D:D,MATCH(Year!A:A,Sept!A:A,0)),\"\")","v":""},{"$f":"IFERROR(INDEX(Oct!D:D,MATCH(Year!A:A,Oct!A:A,0)),\"\")","v":""},{"$f":"IFERROR(INDEX(Nov!D:D,MATCH(Year!A:A,Nov!A:A,0)),\"\")","v":""},{"$f":"IFERROR(INDEX(Dec!D:D,MATCH(Year!A:A,Dec!A:A,0)),\"\")","v":""},{"$f":"IFERROR(INDEX(Jan!D:D,MATCH(Year!A:A,Jan!A:A,0)),\"\")","v":""},{"$f":"IFERROR(INDEX(Feb!D:D,MATCH(Year!A:A,Feb!A:A,0)),\"\")","v":""},{"$f":"IFERROR(INDEX(March!D:D,MATCH(Year!A:A,March!A:A,0)),\"\")","v":""},{"$f":"IF(ISERROR((SUM(B135:M135))/B4),\"\",(SUM(B135:M135))/B4)","v":""}]
[{"$f":"IF(ISERROR('Audit questions'!A36),\"\",'Audit questions'!A36)","v":"Test35"},{"$f":"IFERROR(INDEX(April!D:D,MATCH(Year!A:A,April!A:A,0)),\"\")","v":""},{"$f":"IFERROR(INDEX(May!D:D,MATCH(Year!A:A,May!A:A,0)),\"\")","v":""},{"$f":"IFERROR(INDEX(June!D:D,MATCH(Year!A:A,June!A:A,0)),\"\")","v":""},{"$f":"IFERROR(INDEX(July!D:D,MATCH(Year!A:A,July!A:A,0)),\"\")","v":""},{"$f":"IFERROR(INDEX(Aug!D:D,MATCH(Year!A:A,Aug!A:A,0)),\"\")","v":""},{"$f":"IFERROR(INDEX(Sept!D:D,MATCH(Year!A:A,Sept!A:A,0)),\"\")","v":""},{"$f":"IFERROR(INDEX(Oct!D:D,MATCH(Year!A:A,Oct!A:A,0)),\"\")","v":""},{"$f":"IFERROR(INDEX(Nov!D:D,MATCH(Year!A:A,Nov!A:A,0)),\"\")","v":""},{"$f":"IFERROR(INDEX(Dec!D:D,MATCH(Year!A:A,Dec!A:A,0)),\"\")","v":""},{"$f":"IFERROR(INDEX(Jan!D:D,MATCH(Year!A:A,Jan!A:A,0)),\"\")","v":""},{"$f":"IFERROR(INDEX(Feb!D:D,MATCH(Year!A:A,Feb!A:A,0)),\"\")","v":""},{"$f":"IFERROR(INDEX(March!D:D,MATCH(Year!A:A,March!A:A,0)),\"\")","v":""},{"$f":"IF(ISERROR((SUM(B136:M136))/B4),\"\",(SUM(B136:M136))/B4)","v":""}]
[{"$f":"IF(ISERROR('Audit questions'!A37),\"\",'Audit questions'!A37)","v":"Test36"},{"$f":"IFERROR(INDEX(April!D:D,MATCH(Year!A:A,April!A:A,0)),\"\")","v":""},{"$f":"IFERROR(INDEX(May!D:D,MATCH(Year!A:A,May!A:A,0)),\"\")","v":""},{"$f":"IFERROR(INDEX(June!D:D,MATCH(Year!A:A,June!A:A,0)),\"\")","v":""},{"$f":"IFERROR(INDEX(July!D:D,MATCH(Year!A:A,July!A:A,0)),\"\")","v":""},{"$f":"IFERROR(INDEX(Aug!D:D,MATCH(Year!A:A,Aug!A:A,0)),\"\")","v":""},{"$f":"IFERROR(INDEX(Sept!D:D,MATCH(Year!A:A,Sept!A:A,0)),\"\")","v":""},{"$f":"IFERROR(INDEX(Oct!D:D,MATCH(Year!A:A,Oct!A:A,0)),\"\")","v":""},{"$f":"IFERROR(INDEX(Nov!D:D,MATCH(Year!A:A,Nov!A:A,0)),\"\")","v":""},{"$f":"IFERROR(INDEX(Dec!D:D,MATCH(Year!A:A,Dec!A:A,0)),\"\")","v":""},{"$f":"IFERROR(INDEX(Jan!D:D,MATCH(Year!A:A,Jan!A:A,0)),\"\")","v":""},{"$f":"IFERROR(INDEX(Feb!D:D,MATCH(Year!A:A,Feb!A:A,0)),\"\")","v":""},{"$f":"IFERROR(INDEX(March!D:D,MATCH(Year!A:A,March!A:A,0)),\"\")","v":""},{"$f":"IF(ISERROR((SUM(B137:M137))/B4),\"\",(SUM(B137:M137))/B4)","v":""}]
[{"$f":"IF(ISERROR('Audit questions'!A38),\"\",'Audit questions'!A38)","v":"Test37"},{"$f":"IFERROR(INDEX(April!D:D,MATCH(Year!A:A,April!A:A,0)),\"\")","v":""},{"$f":"IFERROR(INDEX(May!D:D,MATCH(Year!A:A,May!A:A,0)),\"\")","v":""},{"$f":"IFERROR(INDEX(June!D:D,MATCH(Year!A:A,June!A:A,0)),\"\")","v":""},{"$f":"IFERROR(INDEX(July!D:D,MATCH(Year!A:A,July!A:A,0)),\"\")","v":""},{"$f":"IFERROR(INDEX(Aug!D:D,MATCH(Year!A:A,Aug!A:A,0)),\"\")","v":""},{"$f":"IFERROR(INDEX(Sept!D:D,MATCH(Year!A:A,Sept!A:A,0)),\"\")","v":""},{"$f":"IFERROR(INDEX(Oct!D:D,MATCH(Year!A:A,Oct!A:A,0)),\"\")","v":""},{"$f":"IFERROR(INDEX(Nov!D:D,MATCH(Year!A:A,Nov!A:A,0)),\"\")","v":""},{"$f":"IFERROR(INDEX(Dec!D:D,MATCH(Year!A:A,Dec!A:A,0)),\"\")","v":""},{"$f":"IFERROR(INDEX(Jan!D:D,MATCH(Year!A:A,Jan!A:A,0)),\"\")","v":""},{"$f":"IFERROR(INDEX(Feb!D:D,MATCH(Year!A:A,Feb!A:A,0)),\"\")","v":""},{"$f":"IFERROR(INDEX(March!D:D,MATCH(Year!A:A,March!A:A,0)),\"\")","v":""},{"$f":"IF(ISERROR((SUM(B138:M138))/B4),\"\",(SUM(B138:M138))/B4)","v":""}]
[{"$f":"IF(ISERROR('Audit questions'!A39),\"\",'Audit questions'!A39)","v":"Test38"},{"$f":"IFERROR(INDEX(April!D:D,MATCH(Year!A:A,April!A:A,0)),\"\")","v":""},{"$f":"IFERROR(INDEX(May!D:D,MATCH(Year!A:A,May!A:A,0)),\"\")","v":""},{"$f":"IFERROR(INDEX(June!D:D,MATCH(Year!A:A,June!A:A,0)),\"\")","v":""},{"$f":"IFERROR(INDEX(July!D:D,MATCH(Year!A:A,July!A:A,0)),\"\")","v":""},{"$f":"IFERROR(INDEX(Aug!D:D,MATCH(Year!A:A,Aug!A:A,0)),\"\")","v":""},{"$f":"IFERROR(INDEX(Sept!D:D,MATCH(Year!A:A,Sept!A:A,0)),\"\")","v":""},{"$f":"IFERROR(INDEX(Oct!D:D,MATCH(Year!A:A,Oct!A:A,0)),\"\")","v":""},{"$f":"IFERROR(INDEX(Nov!D:D,MATCH(Year!A:A,Nov!A:A,0)),\"\")","v":""},{"$f":"IFERROR(INDEX(Dec!D:D,MATCH(Year!A:A,Dec!A:A,0)),\"\")","v":""},{"$f":"IFERROR(INDEX(Jan!D:D,MATCH(Year!A:A,Jan!A:A,0)),\"\")","v":""},{"$f":"IFERROR(INDEX(Feb!D:D,MATCH(Year!A:A,Feb!A:A,0)),\"\")","v":""},{"$f":"IFERROR(INDEX(March!D:D,MATCH(Year!A:A,March!A:A,0)),\"\")","v":""},{"$f":"IF(ISERROR((SUM(B139:M139))/B4),\"\",(SUM(B139:M139))/B4)","v":""}]
[{"$f":"IF(ISERROR('Audit questions'!A40),\"\",'Audit questions'!A40)","v":"Test39"},{"$f":"IFERROR(INDEX(April!D:D,MATCH(Year!A:A,April!A:A,0)),\"\")","v":""},{"$f":"IFERROR(INDEX(May!D:D,MATCH(Year!A:A,May!A:A,0)),\"\")","v":""},{"$f":"IFERROR(INDEX(June!D:D,MATCH(Year!A:A,June!A:A,0)),\"\")","v":""},{"$f":"IFERROR(INDEX(July!D:D,MATCH(Year!A:A,July!A:A,0)),\"\")","v":""},{"$f":"IFERROR(INDEX(Aug!D:D,MATCH(Year!A:A,Aug!A:A,0)),\"\")","v":""},{"$f":"IFERROR(INDEX(Sept!D:D,MATCH(Year!A:A,Sept!A:A,0)),\"\")","v":""},{"$f":"IFERROR(INDEX(Oct!D:D,MATCH(Year!A:A,Oct!A:A,0)),\"\")","v":""},{"$f":"IFERROR(INDEX(Nov!D:D,MATCH(Year!A:A,Nov!A:A,0)),\"\")","v":""},{"$f":"IFERROR(INDEX(Dec!D:D,MATCH(Year!A:A,Dec!A:A,0)),\"\")","v":""},{"$f":"IFERROR(INDEX(Jan!D:D,MATCH(Year!A:A,Jan!A:A,0)),\"\")","v":""},{"$f":"IFERROR(INDEX(Feb!D:D,MATCH(Year!A:A,Feb!A:A,0)),\"\")","v":""},{"$f":"IFERROR(INDEX(March!D:D,MATCH(Year!A:A,March!A:A,0)),\"\")","v":""},{"$f":"IF(ISERROR((SUM(B140:M140))/B4),\"\",(SUM(B140:M140))/B4)","v":""}]
[{"$f":"IF(ISERROR('Audit questions'!A41),\"\",'Audit questions'!A41)","v":"Test40"},{"$f":"IFERROR(INDEX(April!D:D,MATCH(Year!A:A,April!A:A,0)),\"\")","v":""},{"$f":"IFERROR(INDEX(May!D:D,MATCH(Year!A:A,May!A:A,0)),\"\")","v":""},{"$f":"IFERROR(INDEX(June!D:D,MATCH(Year!A:A,June!A:A,0)),\"\")","v":""},{"$f":"IFERROR(INDEX(July!D:D,MATCH(Year!A:A,July!A:A,0)),\"\")","v":""},{"$f":"IFERROR(INDEX(Aug!D:D,MATCH(Year!A:A,Aug!A:A,0)),\"\")","v":""},{"$f":"IFERROR(INDEX(Sept!D:D,MATCH(Year!A:A,Sept!A:A,0)),\"\")","v":""},{"$f":"IFERROR(INDEX(Oct!D:D,MATCH(Year!A:A,Oct!A:A,0)),\"\")","v":""},{"$f":"IFERROR(INDEX(Nov!D:D,MATCH(Year!A:A,Nov!A:A,0)),\"\")","v":""},{"$f":"IFERROR(INDEX(Dec!D:D,MATCH(Year!A:A,Dec!A:A,0)),\"\")","v":""},{"$f":"IFERROR(INDEX(Jan!D:D,MATCH(Year!A:A,Jan!A:A,0)),\"\")","v":""},{"$f":"IFERROR(INDEX(Feb!D:D,MATCH(Year!A:A,Feb!A:A,0)),\"\")","v":""},{"$f":"IFERROR(INDEX(March!D:D,MATCH(Year!A:A,March!A:A,0)),\"\")","v":""},{"$f":"IF(ISERROR((SUM(B141:M141))/B4),\"\",(SUM(B141:M141))/B4)","v":""}]
["Average",{"$f":"IF(ISERROR((SUM(B102:B141)/April!B8)),\"\",(SUM(B102:B141)/April!B8))","v":""},{"$f":"IF(ISERROR((SUM(B102:B141)/May!B8)),\"\",(SUM(B102:B141)/May!B8))","v":""},{"$f":"IF(ISERROR((SUM(B102:B141)/June!B8)),\"\",(SUM(B102:B141)/June!B8))","v":""},{"$f":"IF(ISERROR((SUM(B102:B141)/July!B8)),\"\",(SUM(B102:B141)/July!B8))","v":""},{"$f":"IF(ISERROR((SUM(B102:B141)/Aug!B8)),\"\",(SUM(B102:B141)/Aug!B8))","v":""},{"$f":"IF(ISERROR((SUM(B102:B141)/Sept!B8)),\"\",(SUM(B102:B141)/Sept!B8))","v":""},{"$f":"IF(ISERROR((SUM(B102:B141)/Oct!B8)),\"\",(SUM(B102:B141)/Oct!B8))","v":""},{"$f":"IF(ISERROR((SUM(B102:B141)/Nov!B8)),\"\",(SUM(B102:B141)/Nov!B8))","v":""},{"$f":"IF(ISERROR((SUM(B102:B141)/Dec!B8)),\"\",(SUM(B102:B141)/Dec!B8))","v":""},{"$f":"IF(ISERROR((SUM(B102:B141)/Jan!B8)),\"\",(SUM(B102:B141)/Jan!B8))","v":""},{"$f":"IF(ISERROR((SUM(B102:B141)/Feb!B8)),\"\",(SUM(B102:B141)/Feb!B8))","v":""},{"$f":"IF(ISERROR((SUM(B102:B141)/March!B8)),\"\",(SUM(B102:B141)/March!B8))","v":""}]
[]
["Not Compliant"]
["Metric","April","May","June","July","August","September","October","November","December","January","February","March","Year average"]
[{"$f":"IF(ISERROR('Audit questions'!A2),\"\",'Audit questions'!A2)","v":"Test1"},{"$f":"IFERROR(INDEX(April!E:E,MATCH(Year!A:A,April!A:A,0)),\"\")","v":""},{"$f":"IFERROR(INDEX(May!E:E,MATCH(Year!A:A,May!A:A,0)),\"\")","v":""},{"$f":"IFERROR(INDEX(June!E:E,MATCH(Year!A:A,June!A:A,0)),\"\")","v":""},{"$f":"IFERROR(INDEX(July!E:E,MATCH(Year!A:A,July!A:A,0)),\"\")","v":""},{"$f":"IFERROR(INDEX(Aug!E:E,MATCH(Year!A:A,Aug!A:A,0)),\"\")","v":""},{"$f":"IFERROR(INDEX(Sept!E:E,MATCH(Year!A:A,Sept!A:A,0)),\"\")","v":""},{"$f":"IFERROR(INDEX(Oct!E:E,MATCH(Year!A:A,Oct!A:A,0)),\"\")","v":""},{"$f":"IFERROR(INDEX(Nov!E:E,MATCH(Year!A:A,Nov!A:A,0)),\"\")","v":""},{"$f":"IFERROR(INDEX(Dec!E:E,MATCH(Year!A:A,Dec!A:A,0)),\"\")","v":""},{"$f":"IFERROR(INDEX(Jan!E:E,MATCH(Year!A:A,Jan!A:A,0)),\"\")","v":""},{"$f":"IFERROR(INDEX(Feb!E:E,MATCH(Year!A:A,Feb!A:A,0)),\"\")","v":""},{"$f":"IFERROR(INDEX(March!E:E,MATCH(Year!A:A,March!A:A,0)),\"\")","v":""},{"$f":"IF(ISERROR((SUM(B146:M146))/B4),\"\",(SUM(B146:M146))/B4)","v":""}]
[{"$f":"IF(ISERROR('Audit questions'!A3),\"\",'Audit questions'!A3)","v":"Test2"},{"$f":"IFERROR(INDEX(April!E:E,MATCH(Year!A:A,April!A:A,0)),\"\")","v":""},{"$f":"IFERROR(INDEX(May!E:E,MATCH(Year!A:A,May!A:A,0)),\"\")","v":""},{"$f":"IFERROR(INDEX(June!E:E,MATCH(Year!A:A,June!A:A,0)),\"\")","v":""},{"$f":"IFERROR(INDEX(July!E:E,MATCH(Year!A:A,July!A:A,0)),\"\")","v":""},{"$f":"IFERROR(INDEX(Aug!E:E,MATCH(Year!A:A,Aug!A:A,0)),\"\")","v":""},{"$f":"IFERROR(INDEX(Sept!E:E,MATCH(Year!A:A,Sept!A:A,0)),\"\")","v":""},{"$f":"IFERROR(INDEX(Oct!E:E,MATCH(Year!A:A,Oct!A:A,0)),\"\")","v":""},{"$f":"IFERROR(INDEX(Nov!E:E,MATCH(Year!A:A,Nov!A:A,0)),\"\")","v":""},{"$f":"IFERROR(INDEX(Dec!E:E,MATCH(Year!A:A,Dec!A:A,0)),\"\")","v":""},{"$f":"IFERROR(INDEX(Jan!E:E,MATCH(Year!A:A,Jan!A:A,0)),\"\")","v":""},{"$f":"IFERROR(INDEX(Feb!E:E,MATCH(Year!A:A,Feb!A:A,0)),\"\")","v":""},{"$f":"IFERROR(INDEX(March!E:E,MATCH(Year!A:A,March!A:A,0)),\"\")","v":""},{"$f":"IF(ISERROR((SUM(B147:M147))/B4),\"\",(SUM(B147:M147))/B4)","v":""}]
[{"$f":"IF(ISERROR('Audit questions'!A4),\"\",'Audit questions'!A4)","v":"Test3"},{"$f":"IFERROR(INDEX(April!E:E,MATCH(Year!A:A,April!A:A,0)),\"\")","v":""},{"$f":"IFERROR(INDEX(May!E:E,MATCH(Year!A:A,May!A:A,0)),\"\")","v":""},{"$f":"IFERROR(INDEX(June!E:E,MATCH(Year!A:A,June!A:A,0)),\"\")","v":""},{"$f":"IFERROR(INDEX(July!E:E,MATCH(Year!A:A,July!A:A,0)),\"\")","v":""},{"$f":"IFERROR(INDEX(Aug!E:E,MATCH(Year!A:A,Aug!A:A,0)),\"\")","v":""},{"$f":"IFERROR(INDEX(Sept!E:E,MATCH(Year!A:A,Sept!A:A,0)),\"\")","v":""},{"$f":"IFERROR(INDEX(Oct!E:E,MATCH(Year!A:A,Oct!A:A,0)),\"\")","v":""},{"$f":"IFERROR(INDEX(Nov!E:E,MATCH(Year!A:A,Nov!A:A,0)),\"\")","v":""},{"$f":"IFERROR(INDEX(Dec!E:E,MATCH(Year!A:A,Dec!A:A,0)),\"\")","v":""},{"$f":"IFERROR(INDEX(Jan!E:E,MATCH(Year!A:A,Jan!A:A,0)),\"\")","v":""},{"$f":"IFERROR(INDEX(Feb!E:E,MATCH(Year!A:A,Feb!A:A,0)),\"\")","v":""},{"$f":"IFERROR(INDEX(March!E:E,MATCH(Year!A:A,March!A:A,0)),\"\")","v":""},{"$f":"IF(ISERROR((SUM(B148:M148))/B4),\"\",(SUM(B148:M148))/B4)","v":""}]
[{"$f":"IF(ISERROR('Audit questions'!A5),\"\",'Audit questions'!A5)","v":"Test4"},{"$f":"IFERROR(INDEX(April!E:E,MATCH(Year!A:A,April!A:A,0)),\"\")","v":""},{"$f":"IFERROR(INDEX(May!E:E,MATCH(Year!A:A,May!A:A,0)),\"\")","v":""},{"$f":"IFERROR(INDEX(June!E:E,MATCH(Year!A:A,June!A:A,0)),\"\")","v":""},{"$f":"IFERROR(INDEX(July!E:E,MATCH(Year!A:A,July!A:A,0)),\"\")","v":""},{"$f":"IFERROR(INDEX(Aug!E:E,MATCH(Year!A:A,Aug!A:A,0)),\"\")","v":""},{"$f":"IFERROR(INDEX(Sept!E:E,MATCH(Year!A:A,Sept!A:A,0)),\"\")","v":""},{"$f":"IFERROR(INDEX(Oct!E:E,MATCH(Year!A:A,Oct!A:A,0)),\"\")","v":""},{"$f":"IFERROR(INDEX(Nov!E:E,MATCH(Year!A:A,Nov!A:A,0)),\"\")","v":""},{"$f":"IFERROR(INDEX(Dec!E:E,MATCH(Year!A:A,Dec!A:A,0)),\"\")","v":""},{"$f":"IFERROR(INDEX(Jan!E:E,MATCH(Year!A:A,Jan!A:A,0)),\"\")","v":""},{"$f":"IFERROR(INDEX(Feb!E:E,MATCH(Year!A:A,Feb!A:A,0)),\"\")","v":""},{"$f":"IFERROR(INDEX(March!E:E,MATCH(Year!A:A,March!A:A,0)),\"\")","v":""},{"$f":"IF(ISERROR((SUM(B149:M149))/B4),\"\",(SUM(B149:M149))/B4)","v":""}]
[{"$f":"IF(ISERROR('Audit questions'!A6),\"\",'Audit questions'!A6)","v":"Test5"},{"$f":"IFERROR(INDEX(April!E:E,MATCH(Year!A:A,April!A:A,0)),\"\")","v":""},{"$f":"IFERROR(INDEX(May!E:E,MATCH(Year!A:A,May!A:A,0)),\"\")","v":""},{"$f":"IFERROR(INDEX(June!E:E,MATCH(Year!A:A,June!A:A,0)),\"\")","v":""},{"$f":"IFERROR(INDEX(July!E:E,MATCH(Year!A:A,July!A:A,0)),\"\")","v":""},{"$f":"IFERROR(INDEX(Aug!E:E,MATCH(Year!A:A,Aug!A:A,0)),\"\")","v":""},{"$f":"IFERROR(INDEX(Sept!E:E,MATCH(Year!A:A,Sept!A:A,0)),\"\")","v":""},{"$f":"IFERROR(INDEX(Oct!E:E,MATCH(Year!A:A,Oct!A:A,0)),\"\")","v":""},{"$f":"IFERROR(INDEX(Nov!E:E,MATCH(Year!A:A,Nov!A:A,0)),\"\")","v":""},{"$f":"IFERROR(INDEX(Dec!E:E,MATCH(Year!A:A,Dec!A:A,0)),\"\")","v":""},{"$f":"IFERROR(INDEX(Jan!E:E,MATCH(Year!A:A,Jan!A:A,0)),\"\")","v":""},{"$f":"IFERROR(INDEX(Feb!E:E,MATCH(Year!A:A,Feb!A:A,0)),\"\")","v":""},{"$f":"IFERROR(INDEX(March!E:E,MATCH(Year!A:A,March!A:A,0)),\"\")","v":""},{"$f":"IF(ISERROR((SUM(B150:M150))/B4),\"\",(SUM(B150:M150))/B4)","v":""}]
[{"$f":"IF(ISERROR('Audit questions'!A7),\"\",'Audit questions'!A7)","v":"Test6"},{"$f":"IFERROR(INDEX(April!E:E,MATCH(Year!A:A,April!A:A,0)),\"\")","v":""},{"$f":"IFERROR(INDEX(May!E:E,MATCH(Year!A:A,May!A:A,0)),\"\")","v":""},{"$f":"IFERROR(INDEX(June!E:E,MATCH(Year!A:A,June!A:A,0)),\"\")","v":""},{"$f":"IFERROR(INDEX(July!E:E,MATCH(Year!A:A,July!A:A,0)),\"\")","v":""},{"$f":"IFERROR(INDEX(Aug!E:E,MATCH(Year!A:A,Aug!A:A,0)),\"\")","v":""},{"$f":"IFERROR(INDEX(Sept!E:E,MATCH(Year!A:A,Sept!A:A,0)),\"\")","v":""},{"$f":"IFERROR(INDEX(Oct!E:E,MATCH(Year!A:A,Oct!A:A,0)),\"\")","v":""},{"$f":"IFERROR(INDEX(Nov!E:E,MATCH(Year!A:A,Nov!A:A,0)),\"\")","v":""},{"$f":"IFERROR(INDEX(Dec!E:E,MATCH(Year!A:A,Dec!A:A,0)),\"\")","v":""},{"$f":"IFERROR(INDEX(Jan!E:E,MATCH(Year!A:A,Jan!A:A,0)),\"\")","v":""},{"$f":"IFERROR(INDEX(Feb!E:E,MATCH(Year!A:A,Feb!A:A,0)),\"\")","v":""},{"$f":"IFERROR(INDEX(March!E:E,MATCH(Year!A:A,March!A:A,0)),\"\")","v":""},{"$f":"IF(ISERROR((SUM(B151:M151))/B4),\"\",(SUM(B151:M151))/B4)","v":""}]
[{"$f":"IF(ISERROR('Audit questions'!A8),\"\",'Audit questions'!A8)","v":"Test7"},{"$f":"IFERROR(INDEX(April!E:E,MATCH(Year!A:A,April!A:A,0)),\"\")","v":""},{"$f":"IFERROR(INDEX(May!E:E,MATCH(Year!A:A,May!A:A,0)),\"\")","v":""},{"$f":"IFERROR(INDEX(June!E:E,MATCH(Year!A:A,June!A:A,0)),\"\")","v":""},{"$f":"IFERROR(INDEX(July!E:E,MATCH(Year!A:A,July!A:A,0)),\"\")","v":""},{"$f":"IFERROR(INDEX(Aug!E:E,MATCH(Year!A:A,Aug!A:A,0)),\"\")","v":""},{"$f":"IFERROR(INDEX(Sept!E:E,MATCH(Year!A:A,Sept!A:A,0)),\"\")","v":""},{"$f":"IFERROR(INDEX(Oct!E:E,MATCH(Year!A:A,Oct!A:A,0)),\"\")","v":""},{"$f":"IFERROR(INDEX(Nov!E:E,MATCH(Year!A:A,Nov!A:A,0)),\"\")","v":""},{"$f":"IFERROR(INDEX(Dec!E:E,MATCH(Year!A:A,Dec!A:A,0)),\"\")","v":""},{"$f":"IFERROR(INDEX(Jan!E:E,MATCH(Year!A:A,Jan!A:A,0)),\"\")","v":""},{"$f":"IFERROR(INDEX(Feb!E:E,MATCH(Year!A:A,Feb!A:A,0)),\"\")","v":""},{"$f":"IFERROR(INDEX(March!E:E,MATCH(Year!A:A,March!A:A,0)),\"\")","v":""},{"$f":"IF(ISERROR((SUM(B152:M152))/B4),\"\",(SUM(B152:M152))/B4)","v":""}]
[{"$f":"IF(ISERROR('Audit questions'!A9),\"\",'Audit questions'!A9)","v":"Test8"},{"$f":"IFERROR(INDEX(April!E:E,MATCH(Year!A:A,April!A:A,0)),\"\")","v":""},{"$f":"IFERROR(INDEX(May!E:E,MATCH(Year!A:A,May!A:A,0)),\"\")","v":""},{"$f":"IFERROR(INDEX(June!E:E,MATCH(Year!A:A,June!A:A,0)),\"\")","v":""},{"$f":"IFERROR(INDEX(July!E:E,MATCH(Year!A:A,July!A:A,0)),\"\")","v":""},{"$f":"IFERROR(INDEX(Aug!E:E,MATCH(Year!A:A,Aug!A:A,0)),\"\")","v":""},{"$f":"IFERROR(INDEX(Sept!E:E,MATCH(Year!A:A,Sept!A:A,0)),\"\")","v":""},{"$f":"IFERROR(INDEX(Oct!E:E,MATCH(Year!A:A,Oct!A:A,0)),\"\")","v":""},{"$f":"IFERROR(INDEX(Nov!E:E,MATCH(Year!A:A,Nov!A:A,0)),\"\")","v":""},{"$f":"IFERROR(INDEX(Dec!E:E,MATCH(Year!A:A,Dec!A:A,0)),\"\")","v":""},{"$f":"IFERROR(INDEX(Jan!E:E,MATCH(Year!A:A,Jan!A:A,0)),\"\")","v":""},{"$f":"IFERROR(INDEX(Feb!E:E,MATCH(Year!A:A,Feb!A:A,0)),\"\")","v":""},{"$f":"IFERROR(INDEX(March!E:E,MATCH(Year!A:A,March!A:A,0)),\"\")","v":""},{"$f":"IF(ISERROR((SUM(B153:M153))/B4),\"\",(SUM(B153:M153))/B4)","v":""}]
[{"$f":"IF(ISERROR('Audit questions'!A10),\"\",'Audit questions'!A10)","v":"Test9"},{"$f":"IFERROR(INDEX(April!E:E,MATCH(Year!A:A,April!A:A,0)),\"\")","v":""},{"$f":"IFERROR(INDEX(May!E:E,MATCH(Year!A:A,May!A:A,0)),\"\")","v":""},{"$f":"IFERROR(INDEX(June!E:E,MATCH(Year!A:A,June!A:A,0)),\"\")","v":""},{"$f":"IFERROR(INDEX(July!E:E,MATCH(Year!A:A,July!A:A,0)),\"\")","v":""},{"$f":"IFERROR(INDEX(Aug!E:E,MATCH(Year!A:A,Aug!A:A,0)),\"\")","v":""},{"$f":"IFERROR(INDEX(Sept!E:E,MATCH(Year!A:A,Sept!A:A,0)),\"\")","v":""},{"$f":"IFERROR(INDEX(Oct!E:E,MATCH(Year!A:A,Oct!A:A,0)),\"\")","v":""},{"$f":"IFERROR(INDEX(Nov!E:E,MATCH(Year!A:A,Nov!A:A,0)),\"\")","v":""},{"$f":"IFERROR(INDEX(Dec!E:E,MATCH(Year!A:A,Dec!A:A,0)),\"\")","v":""},{"$f":"IFERROR(INDEX(Jan!E:E,MATCH(Year!A:A,Jan!A:A,0)),\"\")","v":""},{"$f":"IFERROR(INDEX(Feb!E:E,MATCH(Year!A:A,Feb!A:A,0)),\"\")","v":""},{"$f":"IFERROR(INDEX(March!E:E,MATCH(Year!A:A,March!A:A,0)),\"\")","v":""},{"$f":"IF(ISERROR((SUM(B154:M154))/B4),\"\",(SUM(B154:M154))/B4)","v":""}]
[{"$f":"IF(ISERROR('Audit questions'!A11),\"\",'Audit questions'!A11)","v":"Test10"},{"$f":"IFERROR(INDEX(April!E:E,MATCH(Year!A:A,April!A:A,0)),\"\")","v":""},{"$f":"IFERROR(INDEX(May!E:E,MATCH(Year!A:A,May!A:A,0)),\"\")","v":""},{"$f":"IFERROR(INDEX(June!E:E,MATCH(Year!A:A,June!A:A,0)),\"\")","v":""},{"$f":"IFERROR(INDEX(July!E:E,MATCH(Year!A:A,July!A:A,0)),\"\")","v":""},{"$f":"IFERROR(INDEX(Aug!E:E,MATCH(Year!A:A,Aug!A:A,0)),\"\")","v":""},{"$f":"IFERROR(INDEX(Sept!E:E,MATCH(Year!A:A,Sept!A:A,0)),\"\")","v":""},{"$f":"IFERROR(INDEX(Oct!E:E,MATCH(Year!A:A,Oct!A:A,0)),\"\")","v":""},{"$f":"IFERROR(INDEX(Nov!E:E,MATCH(Year!A:A,Nov!A:A,0)),\"\")","v":""},{"$f":"IFERROR(INDEX(Dec!E:E,MATCH(Year!A:A,Dec!A:A,0)),\"\")","v":""},{"$f":"IFERROR(INDEX(Jan!E:E,MATCH(Year!A:A,Jan!A:A,0)),\"\")","v":""},{"$f":"IFERROR(INDEX(Feb!E:E,MATCH(Year!A:A,Feb!A:A,0)),\"\")","v":""},{"$f":"IFERROR(INDEX(March!E:E,MATCH(Year!A:A,March!A:A,0)),\"\")","v":""},{"$f":"IF(ISERROR((SUM(B155:M155))/B4),\"\",(SUM(B155:M155))/B4)","v":""}]
[{"$f":"IF(ISERROR('Audit questions'!A12),\"\",'Audit questions'!A12)","v":"Test11"},{"$f":"IFERROR(INDEX(April!E:E,MATCH(Year!A:A,April!A:A,0)),\"\")","v":""},{"$f":"IFERROR(INDEX(May!E:E,MATCH(Year!A:A,May!A:A,0)),\"\")","v":""},{"$f":"IFERROR(INDEX(June!E:E,MATCH(Year!A:A,June!A:A,0)),\"\")","v":""},{"$f":"IFERROR(INDEX(July!E:E,MATCH(Year!A:A,July!A:A,0)),\"\")","v":""},{"$f":"IFERROR(INDEX(Aug!E:E,MATCH(Year!A:A,Aug!A:A,0)),\"\")","v":""},{"$f":"IFERROR(INDEX(Sept!E:E,MATCH(Year!A:A,Sept!A:A,0)),\"\")","v":""},{"$f":"IFERROR(INDEX(Oct!E:E,MATCH(Year!A:A,Oct!A:A,0)),\"\")","v":""},{"$f":"IFERROR(INDEX(Nov!E:E,MATCH(Year!A:A,Nov!A:A,0)),\"\")","v":""},{"$f":"IFERROR(INDEX(Dec!E:E,MATCH(Year!A:A,Dec!A:A,0)),\"\")","v":""},{"$f":"IFERROR(INDEX(Jan!E:E,MATCH(Year!A:A,Jan!A:A,0)),\"\")","v":""},{"$f":"IFERROR(INDEX(Feb!E:E,MATCH(Year!A:A,Feb!A:A,0)),\"\")","v":""},{"$f":"IFERROR(INDEX(March!E:E,MATCH(Year!A:A,March!A:A,0)),\"\")","v":""},{"$f":"IF(ISERROR((SUM(B156:M156))/B4),\"\",(SUM(B156:M156))/B4)","v":""}]
[{"$f":"IF(ISERROR('Audit questions'!A13),\"\",'Audit questions'!A13)","v":"Test12"},{"$f":"IFERROR(INDEX(April!E:E,MATCH(Year!A:A,April!A:A,0)),\"\")","v":""},{"$f":"IFERROR(INDEX(May!E:E,MATCH(Year!A:A,May!A:A,0)),\"\")","v":""},{"$f":"IFERROR(INDEX(June!E:E,MATCH(Year!A:A,June!A:A,0)),\"\")","v":""},{"$f":"IFERROR(INDEX(July!E:E,MATCH(Year!A:A,July!A:A,0)),\"\")","v":""},{"$f":"IFERROR(INDEX(Aug!E:E,MATCH(Year!A:A,Aug!A:A,0)),\"\")","v":""},{"$f":"IFERROR(INDEX(Sept!E:E,MATCH(Year!A:A,Sept!A:A,0)),\"\")","v":""},{"$f":"IFERROR(INDEX(Oct!E:E,MATCH(Year!A:A,Oct!A:A,0)),\"\")","v":""},{"$f":"IFERROR(INDEX(Nov!E:E,MATCH(Year!A:A,Nov!A:A,0)),\"\")","v":""},{"$f":"IFERROR(INDEX(Dec!E:E,MATCH(Year!A:A,Dec!A:A,0)),\"\")","v":""},{"$f":"IFERROR(INDEX(Jan!E:E,MATCH(Year!A:A,Jan!A:A,0)),\"\")","v":""},{"$f":"IFERROR(INDEX(Feb!E:E,MATCH(Year!A:A,Feb!A:A,0)),\"\")","v":""},{"$f":"IFERROR(INDEX(March!E:E,MATCH(Year!A:A,March!A:A,0)),\"\")","v":""},{"$f":"IF(ISERROR((SUM(B157:M157))/B4),\"\",(SUM(B157:M157))/B4)","v":""}]
[{"$f":"IF(ISERROR('Audit questions'!A14),\"\",'Audit questions'!A14)","v":"Test13"},{"$f":"IFERROR(INDEX(April!E:E,MATCH(Year!A:A,April!A:A,0)),\"\")","v":""},{"$f":"IFERROR(INDEX(May!E:E,MATCH(Year!A:A,May!A:A,0)),\"\")","v":""},{"$f":"IFERROR(INDEX(June!E:E,MATCH(Year!A:A,June!A:A,0)),\"\")","v":""},{"$f":"IFERROR(INDEX(July!E:E,MATCH(Year!A:A,July!A:A,0)),\"\")","v":""},{"$f":"IFERROR(INDEX(Aug!E:E,MATCH(Year!A:A,Aug!A:A,0)),\"\")","v":""},{"$f":"IFERROR(INDEX(Sept!E:E,MATCH(Year!A:A,Sept!A:A,0)),\"\")","v":""},{"$f":"IFERROR(INDEX(Oct!E:E,MATCH(Year!A:A,Oct!A:A,0)),\"\")","v":""},{"$f":"IFERROR(INDEX(Nov!E:E,MATCH(Year!A:A,Nov!A:A,0)),\"\")","v":""},{"$f":"IFERROR(INDEX(Dec!E:E,MATCH(Year!A:A,Dec!A:A,0)),\"\")","v":""},{"$f":"IFERROR(INDEX(Jan!E:E,MATCH(Year!A:A,Jan!A:A,0)),\"\")","v":""},{"$f":"IFERROR(INDEX(Feb!E:E,MATCH(Year!A:A,Feb!A:A,0)),\"\")","v":""},{"$f":"IFERROR(INDEX(March!E:E,MATCH(Year!A:A,March!A:A,0)),\"\")","v":""},{"$f":"IF(ISERROR((SUM(B158:M158))/B4),\"\",(SUM(B158:M158))/B4)","v":""}]
[{"$f":"IF(ISERROR('Audit questions'!A15),\"\",'Audit questions'!A15)","v":"Test14"},{"$f":"IFERROR(INDEX(April!E:E,MATCH(Year!A:A,April!A:A,0)),\"\")","v":""},{"$f":"IFERROR(INDEX(May!E:E,MATCH(Year!A:A,May!A:A,0)),\"\")","v":""},{"$f":"IFERROR(INDEX(June!E:E,MATCH(Year!A:A,June!A:A,0)),\"\")","v":""},{"$f":"IFERROR(INDEX(July!E:E,MATCH(Year!A:A,July!A:A,0)),\"\")","v":""},{"$f":"IFERROR(INDEX(Aug!E:E,MATCH(Year!A:A,Aug!A:A,0)),\"\")","v":""},{"$f":"IFERROR(INDEX(Sept!E:E,MATCH(Year!A:A,Sept!A:A,0)),\"\")","v":""},{"$f":"IFERROR(INDEX(Oct!E:E,MATCH(Year!A:A,Oct!A:A,0)),\"\")","v":""},{"$f":"IFERROR(INDEX(Nov!E:E,MATCH(Year!A:A,Nov!A:A,0)),\"\")","v":""},{"$f":"IFERROR(INDEX(Dec!E:E,MATCH(Year!A:A,Dec!A:A,0)),\"\")","v":""},{"$f":"IFERROR(INDEX(Jan!E:E,MATCH(Year!A:A,Jan!A:A,0)),\"\")","v":""},{"$f":"IFERROR(INDEX(Feb!E:E,MATCH(Year!A:A,Feb!A:A,0)),\"\")","v":""},{"$f":"IFERROR(INDEX(March!E:E,MATCH(Year!A:A,March!A:A,0)),\"\")","v":""},{"$f":"IF(ISERROR((SUM(B159:M159))/B4),\"\",(SUM(B159:M159))/B4)","v":""}]
[{"$f":"IF(ISERROR('Audit questions'!A16),\"\",'Audit questions'!A16)","v":"Test15"},{"$f":"IFERROR(INDEX(April!E:E,MATCH(Year!A:A,April!A:A,0)),\"\")","v":""},{"$f":"IFERROR(INDEX(May!E:E,MATCH(Year!A:A,May!A:A,0)),\"\")","v":""},{"$f":"IFERROR(INDEX(June!E:E,MATCH(Year!A:A,June!A:A,0)),\"\")","v":""},{"$f":"IFERROR(INDEX(July!E:E,MATCH(Year!A:A,July!A:A,0)),\"\")","v":""},{"$f":"IFERROR(INDEX(Aug!E:E,MATCH(Year!A:A,Aug!A:A,0)),\"\")","v":""},{"$f":"IFERROR(INDEX(Sept!E:E,MATCH(Year!A:A,Sept!A:A,0)),\"\")","v":""},{"$f":"IFERROR(INDEX(Oct!E:E,MATCH(Year!A:A,Oct!A:A,0)),\"\")","v":""},{"$f":"IFERROR(INDEX(Nov!E:E,MATCH(Year!A:A,Nov!A:A,0)),\"\")","v":""},{"$f":"IFERROR(INDEX(Dec!E:E,MATCH(Year!A:A,Dec!A:A,0)),\"\")","v":""},{"$f":"IFERROR(INDEX(Jan!E:E,MATCH(Year!A:A,Jan!A:A,0)),\"\")","v":""},{"$f":"IFERROR(INDEX(Feb!E:E,MATCH(Year!A:A,Feb!A:A,0)),\"\")","v":""},{"$f":"IFERROR(INDEX(March!E:E,MATCH(Year!A:A,March!A:A,0)),\"\")","v":""},{"$f":"IF(ISERROR((SUM(B160:M160))/B4),\"\",(SUM(B160:M160))/B4)","v":""}]
[{"$f":"IF(ISERROR('Audit questions'!A17),\"\",'Audit questions'!A17)","v":"Test16"},{"$f":"IFERROR(INDEX(April!E:E,MATCH(Year!A:A,April!A:A,0)),\"\")","v":""},{"$f":"IFERROR(INDEX(May!E:E,MATCH(Year!A:A,May!A:A,0)),\"\")","v":""},{"$f":"IFERROR(INDEX(June!E:E,MATCH(Year!A:A,June!A:A,0)),\"\")","v":""},{"$f":"IFERROR(INDEX(July!E:E,MATCH(Year!A:A,July!A:A,0)),\"\")","v":""},{"$f":"IFERROR(INDEX(Aug!E:E,MATCH(Year!A:A,Aug!A:A,0)),\"\")","v":""},{"$f":"IFERROR(INDEX(Sept!E:E,MATCH(Year!A:A,Sept!A:A,0)),\"\")","v":""},{"$f":"IFERROR(INDEX(Oct!E:E,MATCH(Year!A:A,Oct!A:A,0)),\"\")","v":""},{"$f":"IFERROR(INDEX(Nov!E:E,MATCH(Year!A:A,Nov!A:A,0)),\"\")","v":""},{"$f":"IFERROR(INDEX(Dec!E:E,MATCH(Year!A:A,Dec!A:A,0)),\"\")","v":""},{"$f":"IFERROR(INDEX(Jan!E:E,MATCH(Year!A:A,Jan!A:A,0)),\"\")","v":""},{"$f":"IFERROR(INDEX(Feb!E:E,MATCH(Year!A:A,Feb!A:A,0)),\"\")","v":""},{"$f":"IFERROR(INDEX(March!E:E,MATCH(Year!A:A,March!A:A,0)),\"\")","v":""},{"$f":"IF(ISERROR((SUM(B161:M161))/B4),\"\",(SUM(B161:M161))/B4)","v":""}]
[{"$f":"IF(ISERROR('Audit questions'!A18),\"\",'Audit questions'!A18)","v":"Test17"},{"$f":"IFERROR(INDEX(April!E:E,MATCH(Year!A:A,April!A:A,0)),\"\")","v":""},{"$f":"IFERROR(INDEX(May!E:E,MATCH(Year!A:A,May!A:A,0)),\"\")","v":""},{"$f":"IFERROR(INDEX(June!E:E,MATCH(Year!A:A,June!A:A,0)),\"\")","v":""},{"$f":"IFERROR(INDEX(July!E:E,MATCH(Year!A:A,July!A:A,0)),\"\")","v":""},{"$f":"IFERROR(INDEX(Aug!E:E,MATCH(Year!A:A,Aug!A:A,0)),\"\")","v":""},{"$f":"IFERROR(INDEX(Sept!E:E,MATCH(Year!A:A,Sept!A:A,0)),\"\")","v":""},{"$f":"IFERROR(INDEX(Oct!E:E,MATCH(Year!A:A,Oct!A:A,0)),\"\")","v":""},{"$f":"IFERROR(INDEX(Nov!E:E,MATCH(Year!A:A,Nov!A:A,0)),\"\")","v":""},{"$f":"IFERROR(INDEX(Dec!E:E,MATCH(Year!A:A,Dec!A:A,0)),\"\")","v":""},{"$f":"IFERROR(INDEX(Jan!E:E,MATCH(Year!A:A,Jan!A:A,0)),\"\")","v":""},{"$f":"IFERROR(INDEX(Feb!E:E,MATCH(Year!A:A,Feb!A:A,0)),\"\")","v":""},{"$f":"IFERROR(INDEX(March!E:E,MATCH(Year!A:A,March!A:A,0)),\"\")","v":""},{"$f":"IF(ISERROR((SUM(B162:M162))/B4),\"\",(SUM(B162:M162))/B4)","v":""}]
[{"$f":"IF(ISERROR('Audit questions'!A19),\"\",'Audit questions'!A19)","v":"Test18"},{"$f":"IFERROR(INDEX(April!E:E,MATCH(Year!A:A,April!A:A,0)),\"\")","v":""},{"$f":"IFERROR(INDEX(May!E:E,MATCH(Year!A:A,May!A:A,0)),\"\")","v":""},{"$f":"IFERROR(INDEX(June!E:E,MATCH(Year!A:A,June!A:A,0)),\"\")","v":""},{"$f":"IFERROR(INDEX(July!E:E,MATCH(Year!A:A,July!A:A,0)),\"\")","v":""},{"$f":"IFERROR(INDEX(Aug!E:E,MATCH(Year!A:A,Aug!A:A,0)),\"\")","v":""},{"$f":"IFERROR(INDEX(Sept!E:E,MATCH(Year!A:A,Sept!A:A,0)),\"\")","v":""},{"$f":"IFERROR(INDEX(Oct!E:E,MATCH(Year!A:A,Oct!A:A,0)),\"\")","v":""},{"$f":"IFERROR(INDEX(Nov!E:E,MATCH(Year!A:A,Nov!A:A,0)),\"\")","v":""},{"$f":"IFERROR(INDEX(Dec!E:E,MATCH(Year!A:A,Dec!A:A,0)),\"\")","v":""},{"$f":"IFERROR(INDEX(Jan!E:E,MATCH(Year!A:A,Jan!A:A,0)),\"\")","v":""},{"$f":"IFERROR(INDEX(Feb!E:E,MATCH(Year!A:A,Feb!A:A,0)),\"\")","v":""},{"$f":"IFERROR(INDEX(March!E:E,MATCH(Year!A:A,March!A:A,0)),\"\")","v":""},{"$f":"IF(ISERROR((SUM(B163:M163))/B4),\"\",(SUM(B163:M163))/B4)","v":""}]
[{"$f":"IF(ISERROR('Audit questions'!A20),\"\",'Audit questions'!A20)","v":"Test19"},{"$f":"IFERROR(INDEX(April!E:E,MATCH(Year!A:A,April!A:A,0)),\"\")","v":""},{"$f":"IFERROR(INDEX(May!E:E,MATCH(Year!A:A,May!A:A,0)),\"\")","v":""},{"$f":"IFERROR(INDEX(June!E:E,MATCH(Year!A:A,June!A:A,0)),\"\")","v":""},{"$f":"IFERROR(INDEX(July!E:E,MATCH(Year!A:A,July!A:A,0)),\"\")","v":""},{"$f":"IFERROR(INDEX(Aug!E:E,MATCH(Year!A:A,Aug!A:A,0)),\"\")","v":""},{"$f":"IFERROR(INDEX(Sept!E:E,MATCH(Year!A:A,Sept!A:A,0)),\"\")","v":""},{"$f":"IFERROR(INDEX(Oct!E:E,MATCH(Year!A:A,Oct!A:A,0)),\"\")","v":""},{"$f":"IFERROR(INDEX(Nov!E:E,MATCH(Year!A:A,Nov!A:A,0)),\"\")","v":""},{"$f":"IFERROR(INDEX(Dec!E:E,MATCH(Year!A:A,Dec!A:A,0)),\"\")","v":""},{"$f":"IFERROR(INDEX(Jan!E:E,MATCH(Year!A:A,Jan!A:A,0)),\"\")","v":""},{"$f":"IFERROR(INDEX(Feb!E:E,MATCH(Year!A:A,Feb!A:A,0)),\"\")","v":""},{"$f":"IFERROR(INDEX(March!E:E,MATCH(Year!A:A,March!A:A,0)),\"\")","v":""},{"$f":"IF(ISERROR((SUM(B164:M164))/B4),\"\",(SUM(B164:M164))/B4)","v":""}]
[{"$f":"IF(ISERROR('Audit questions'!A21),\"\",'Audit questions'!A21)","v":"Test20"},{"$f":"IFERROR(INDEX(April!E:E,MATCH(Year!A:A,April!A:A,0)),\"\")","v":""},{"$f":"IFERROR(INDEX(May!E:E,MATCH(Year!A:A,May!A:A,0)),\"\")","v":""},{"$f":"IFERROR(INDEX(June!E:E,MATCH(Year!A:A,June!A:A,0)),\"\")","v":""},{"$f":"IFERROR(INDEX(July!E:E,MATCH(Year!A:A,July!A:A,0)),\"\")","v":""},{"$f":"IFERROR(INDEX(Aug!E:E,MATCH(Year!A:A,Aug!A:A,0)),\"\")","v":""},{"$f":"IFERROR(INDEX(Sept!E:E,MATCH(Year!A:A,Sept!A:A,0)),\"\")","v":""},{"$f":"IFERROR(INDEX(Oct!E:E,MATCH(Year!A:A,Oct!A:A,0)),\"\")","v":""},{"$f":"IFERROR(INDEX(Nov!E:E,MATCH(Year!A:A,Nov!A:A,0)),\"\")","v":""},{"$f":"IFERROR(INDEX(Dec!E:E,MATCH(Year!A:A,Dec!A:A,0)),\"\")","v":""},{"$f":"IFERROR(INDEX(Jan!E:E,MATCH(Year!A:A,Jan!A:A,0)),\"\")","v":""},{"$f":"IFERROR(INDEX(Feb!E:E,MATCH(Year!A:A,Feb!A:A,0)),\"\")","v":""},{"$f":"IFERROR(INDEX(March!E:E,MATCH(Year!A:A,March!A:A,0)),\"\")","v":""},{"$f":"IF(ISERROR((SUM(B165:M165))/B4),\"\",(SUM(B165:M165))/B4)","v":""}]
[{"$f":"IF(ISERROR('Audit questions'!A22),\"\",'Audit questions'!A22)","v":"Test21"},{"$f":"IFERROR(INDEX(April!E:E,MATCH(Year!A:A,April!A:A,0)),\"\")","v":""},{"$f":"IFERROR(INDEX(May!E:E,MATCH(Year!A:A,May!A:A,0)),\"\")","v":""},{"$f":"IFERROR(INDEX(June!E:E,MATCH(Year!A:A,June!A:A,0)),\"\")","v":""},{"$f":"IFERROR(INDEX(July!E:E,MATCH(Year!A:A,July!A:A,0)),\"\")","v":""},{"$f":"IFERROR(INDEX(Aug!E:E,MATCH(Year!A:A,Aug!A:A,0)),\"\")","v":""},{"$f":"IFERROR(INDEX(Sept!E:E,MATCH(Year!A:A,Sept!A:A,0)),\"\")","v":""},{"$f":"IFERROR(INDEX(Oct!E:E,MATCH(Year!A:A,Oct!A:A,0)),\"\")","v":""},{"$f":"IFERROR(INDEX(Nov!E:E,MATCH(Year!A:A,Nov!A:A,0)),\"\")","v":""},{"$f":"IFERROR(INDEX(Dec!E:E,MATCH(Year!A:A,Dec!A:A,0)),\"\")","v":""},{"$f":"IFERROR(INDEX(Jan!E:E,MATCH(Year!A:A,Jan!A:A,0)),\"\")","v":""},{"$f":"IFERROR(INDEX(Feb!E:E,MATCH(Year!A:A,Feb!A:A,0)),\"\")","v":""},{"$f":"IFERROR(INDEX(March!E:E,MATCH(Year!A:A,March!A:A,0)),\"\")","v":""},{"$f":"IF(ISERROR((SUM(B166:M166))/B4),\"\",(SUM(B166:M166))/B4)","v":""}]
[{"$f":"IF(ISERROR('Audit questions'!A23),\"\",'Audit questions'!A23)","v":"Test22"},{"$f":"IFERROR(INDEX(April!E:E,MATCH(Year!A:A,April!A:A,0)),\"\")","v":""},{"$f":"IFERROR(INDEX(May!E:E,MATCH(Year!A:A,May!A:A,0)),\"\")","v":""},{"$f":"IFERROR(INDEX(June!E:E,MATCH(Year!A:A,June!A:A,0)),\"\")","v":""},{"$f":"IFERROR(INDEX(July!E:E,MATCH(Year!A:A,July!A:A,0)),\"\")","v":""},{"$f":"IFERROR(INDEX(Aug!E:E,MATCH(Year!A:A,Aug!A:A,0)),\"\")","v":""},{"$f":"IFERROR(INDEX(Sept!E:E,MATCH(Year!A:A,Sept!A:A,0)),\"\")","v":""},{"$f":"IFERROR(INDEX(Oct!E:E,MATCH(Year!A:A,Oct!A:A,0)),\"\")","v":""},{"$f":"IFERROR(INDEX(Nov!E:E,MATCH(Year!A:A,Nov!A:A,0)),\"\")","v":""},{"$f":"IFERROR(INDEX(Dec!E:E,MATCH(Year!A:A,Dec!A:A,0)),\"\")","v":""},{"$f":"IFERROR(INDEX(Jan!E:E,MATCH(Year!A:A,Jan!A:A,0)),\"\")","v":""},{"$f":"IFERROR(INDEX(Feb!E:E,MATCH(Year!A:A,Feb!A:A,0)),\"\")","v":""},{"$f":"IFERROR(INDEX(March!E:E,MATCH(Year!A:A,March!A:A,0)),\"\")","v":""},{"$f":"IF(ISERROR((SUM(B167:M167))/B4),\"\",(SUM(B167:M167))/B4)","v":""}]
[{"$f":"IF(ISERROR('Audit questions'!A24),\"\",'Audit questions'!A24)","v":"Test23"},{"$f":"IFERROR(INDEX(April!E:E,MATCH(Year!A:A,April!A:A,0)),\"\")","v":""},{"$f":"IFERROR(INDEX(May!E:E,MATCH(Year!A:A,May!A:A,0)),\"\")","v":""},{"$f":"IFERROR(INDEX(June!E:E,MATCH(Year!A:A,June!A:A,0)),\"\")","v":""},{"$f":"IFERROR(INDEX(July!E:E,MATCH(Year!A:A,July!A:A,0)),\"\")","v":""},{"$f":"IFERROR(INDEX(Aug!E:E,MATCH(Year!A:A,Aug!A:A,0)),\"\")","v":""},{"$f":"IFERROR(INDEX(Sept!E:E,MATCH(Year!A:A,Sept!A:A,0)),\"\")","v":""},{"$f":"IFERROR(INDEX(Oct!E:E,MATCH(Year!A:A,Oct!A:A,0)),\"\")","v":""},{"$f":"IFERROR(INDEX(Nov!E:E,MATCH(Year!A:A,Nov!A:A,0)),\"\")","v":""},{"$f":"IFERROR(INDEX(Dec!E:E,MATCH(Year!A:A,Dec!A:A,0)),\"\")","v":""},{"$f":"IFERROR(INDEX(Jan!E:E,MATCH(Year!A:A,Jan!A:A,0)),\"\")","v":""},{"$f":"IFERROR(INDEX(Feb!E:E,MATCH(Year!A:A,Feb!A:A,0)),\"\")","v":""},{"$f":"IFERROR(INDEX(March!E:E,MATCH(Year!A:A,March!A:A,0)),\"\")","v":""},{"$f":"IF(ISERROR((SUM(B168:M168))/B4),\"\",(SUM(B168:M168))/B4)","v":""}]
[{"$f":"IF(ISERROR('Audit questions'!A25),\"\",'Audit questions'!A25)","v":"Test24"},{"$f":"IFERROR(INDEX(April!E:E,MATCH(Year!A:A,April!A:A,0)),\"\")","v":""},{"$f":"IFERROR(INDEX(May!E:E,MATCH(Year!A:A,May!A:A,0)),\"\")","v":""},{"$f":"IFERROR(INDEX(June!E:E,MATCH(Year!A:A,June!A:A,0)),\"\")","v":""},{"$f":"IFERROR(INDEX(July!E:E,MATCH(Year!A:A,July!A:A,0)),\"\")","v":""},{"$f":"IFERROR(INDEX(Aug!E:E,MATCH(Year!A:A,Aug!A:A,0)),\"\")","v":""},{"$f":"IFERROR(INDEX(Sept!E:E,MATCH(Year!A:A,Sept!A:A,0)),\"\")","v":""},{"$f":"IFERROR(INDEX(Oct!E:E,MATCH(Year!A:A,Oct!A:A,0)),\"\")","v":""},{"$f":"IFERROR(INDEX(Nov!E:E,MATCH(Year!A:A,Nov!A:A,0)),\"\")","v":""},{"$f":"IFERROR(INDEX(Dec!E:E,MATCH(Year!A:A,Dec!A:A,0)),\"\")","v":""},{"$f":"IFERROR(INDEX(Jan!E:E,MATCH(Year!A:A,Jan!A:A,0)),\"\")","v":""},{"$f":"IFERROR(INDEX(Feb!E:E,MATCH(Year!A:A,Feb!A:A,0)),\"\")","v":""},{"$f":"IFERROR(INDEX(March!E:E,MATCH(Year!A:A,March!A:A,0)),\"\")","v":""},{"$f":"IF(ISERROR((SUM(B169:M169))/B4),\"\",(SUM(B169:M169))/B4)","v":""}]
[{"$f":"IF(ISERROR('Audit questions'!A26),\"\",'Audit questions'!A26)","v":"Test25"},{"$f":"IFERROR(INDEX(April!E:E,MATCH(Year!A:A,April!A:A,0)),\"\")","v":""},{"$f":"IFERROR(INDEX(May!E:E,MATCH(Year!A:A,May!A:A,0)),\"\")","v":""},{"$f":"IFERROR(INDEX(June!E:E,MATCH(Year!A:A,June!A:A,0)),\"\")","v":""},{"$f":"IFERROR(INDEX(July!E:E,MATCH(Year!A:A,July!A:A,0)),\"\")","v":""},{"$f":"IFERROR(INDEX(Aug!E:E,MATCH(Year!A:A,Aug!A:A,0)),\"\")","v":""},{"$f":"IFERROR(INDEX(Sept!E:E,MATCH(Year!A:A,Sept!A:A,0)),\"\")","v":""},{"$f":"IFERROR(INDEX(Oct!E:E,MATCH(Year!A:A,Oct!A:A,0)),\"\")","v":""},{"$f":"IFERROR(INDEX(Nov!E:E,MATCH(Year!A:A,Nov!A:A,0)),\"\")","v":""},{"$f":"IFERROR(INDEX(Dec!E:E,MATCH(Year!A:A,Dec!A:A,0)),\"\")","v":""},{"$f":"IFERROR(INDEX(Jan!E:E,MATCH(Year!A:A,Jan!A:A,0)),\"\")","v":""},{"$f":"IFERROR(INDEX(Feb!E:E,MATCH(Year!A:A,Feb!A:A,0)),\"\")","v":""},{"$f":"IFERROR(INDEX(March!E:E,MATCH(Year!A:A,March!A:A,0)),\"\")","v":""},{"$f":"IF(ISERROR((SUM(B170:M170))/B4),\"\",(SUM(B170:M170))/B4)","v":""}]
[{"$f":"IF(ISERROR('Audit questions'!A27),\"\",'Audit questions'!A27)","v":"Test26"},{"$f":"IFERROR(INDEX(April!E:E,MATCH(Year!A:A,April!A:A,0)),\"\")","v":""},{"$f":"IFERROR(INDEX(May!E:E,MATCH(Year!A:A,May!A:A,0)),\"\")","v":""},{"$f":"IFERROR(INDEX(June!E:E,MATCH(Year!A:A,June!A:A,0)),\"\")","v":""},{"$f":"IFERROR(INDEX(July!E:E,MATCH(Year!A:A,July!A:A,0)),\"\")","v":""},{"$f":"IFERROR(INDEX(Aug!E:E,MATCH(Year!A:A,Aug!A:A,0)),\"\")","v":""},{"$f":"IFERROR(INDEX(Sept!E:E,MATCH(Year!A:A,Sept!A:A,0)),\"\")","v":""},{"$f":"IFERROR(INDEX(Oct!E:E,MATCH(Year!A:A,Oct!A:A,0)),\"\")","v":""},{"$f":"IFERROR(INDEX(Nov!E:E,MATCH(Year!A:A,Nov!A:A,0)),\"\")","v":""},{"$f":"IFERROR(INDEX(Dec!E:E,MATCH(Year!A:A,Dec!A:A,0)),\"\")","v":""},{"$f":"IFERROR(INDEX(Jan!E:E,MATCH(Year!A:A,Jan!A:A,0)),\"\")","v":""},{"$f":"IFERROR(INDEX(Feb!E:E,MATCH(Year!A:A,Feb!A:A,0)),\"\")","v":""},{"$f":"IFERROR(INDEX(March!E:E,MATCH(Year!A:A,March!A:A,0)),\"\")","v":""},{"$f":"IF(ISERROR((SUM(B171:M171))/B4),\"\",(SUM(B171:M171))/B4)","v":""}]
[{"$f":"IF(ISERROR('Audit questions'!A28),\"\",'Audit questions'!A28)","v":"Test27"},{"$f":"IFERROR(INDEX(April!E:E,MATCH(Year!A:A,April!A:A,0)),\"\")","v":""},{"$f":"IFERROR(INDEX(May!E:E,MATCH(Year!A:A,May!A:A,0)),\"\")","v":""},{"$f":"IFERROR(INDEX(June!E:E,MATCH(Year!A:A,June!A:A,0)),\"\")","v":""},{"$f":"IFERROR(INDEX(July!E:E,MATCH(Year!A:A,July!A:A,0)),\"\")","v":""},{"$f":"IFERROR(INDEX(Aug!E:E,MATCH(Year!A:A,Aug!A:A,0)),\"\")","v":""},{"$f":"IFERROR(INDEX(Sept!E:E,MATCH(Year!A:A,Sept!A:A,0)),\"\")","v":""},{"$f":"IFERROR(INDEX(Oct!E:E,MATCH(Year!A:A,Oct!A:A,0)),\"\")","v":""},{"$f":"IFERROR(INDEX(Nov!E:E,MATCH(Year!A:A,Nov!A:A,0)),\"\")","v":""},{"$f":"IFERROR(INDEX(Dec!E:E,MATCH(Year!A:A,Dec!A:A,0)),\"\")","v":""},{"$f":"IFERROR(INDEX(Jan!E:E,MATCH(Year!A:A,Jan!A:A,0)),\"\")","v":""},{"$f":"IFERROR(INDEX(Feb!E:E,MATCH(Year!A:A,Feb!A:A,0)),\"\")","v":""},{"$f":"IFERROR(INDEX(March!E:E,MATCH(Year!A:A,March!A:A,0)),\"\")","v":""},{"$f":"IF(ISERROR((SUM(B172:M172))/B4),\"\",(SUM(B172:M172))/B4)","v":""}]
[{"$f":"IF(ISERROR('Audit questions'!A29),\"\",'Audit questions'!A29)","v":"Test28"},{"$f":"IFERROR(INDEX(April!E:E,MATCH(Year!A:A,April!A:A,0)),\"\")","v":""},{"$f":"IFERROR(INDEX(May!E:E,MATCH(Year!A:A,May!A:A,0)),\"\")","v":""},{"$f":"IFERROR(INDEX(June!E:E,MATCH(Year!A:A,June!A:A,0)),\"\")","v":""},{"$f":"IFERROR(INDEX(July!E:E,MATCH(Year!A:A,July!A:A,0)),\"\")","v":""},{"$f":"IFERROR(INDEX(Aug!E:E,MATCH(Year!A:A,Aug!A:A,0)),\"\")","v":""},{"$f":"IFERROR(INDEX(Sept!E:E,MATCH(Year!A:A,Sept!A:A,0)),\"\")","v":""},{"$f":"IFERROR(INDEX(Oct!E:E,MATCH(Year!A:A,Oct!A:A,0)),\"\")","v":""},{"$f":"IFERROR(INDEX(Nov!E:E,MATCH(Year!A:A,Nov!A:A,0)),\"\")","v":""},{"$f":"IFERROR(INDEX(Dec!E:E,MATCH(Year!A:A,Dec!A:A,0)),\"\")","v":""},{"$f":"IFERROR(INDEX(Jan!E:E,MATCH(Year!A:A,Jan!A:A,0)),\"\")","v":""},{"$f":"IFERROR(INDEX(Feb!E:E,MATCH(Year!A:A,Feb!A:A,0)),\"\")","v":""},{"$f":"IFERROR(INDEX(March!E:E,MATCH(Year!A:A,March!A:A,0)),\"\")","v":""},{"$f":"IF(ISERROR((SUM(B173:M173))/B4),\"\",(SUM(B173:M173))/B4)","v":""}]
[{"$f":"IF(ISERROR('Audit questions'!A30),\"\",'Audit questions'!A30)","v":"Test29"},{"$f":"IFERROR(INDEX(April!E:E,MATCH(Year!A:A,April!A:A,0)),\"\")","v":""},{"$f":"IFERROR(INDEX(May!E:E,MATCH(Year!A:A,May!A:A,0)),\"\")","v":""},{"$f":"IFERROR(INDEX(June!E:E,MATCH(Year!A:A,June!A:A,0)),\"\")","v":""},{"$f":"IFERROR(INDEX(July!E:E,MATCH(Year!A:A,July!A:A,0)),\"\")","v":""},{"$f":"IFERROR(INDEX(Aug!E:E,MATCH(Year!A:A,Aug!A:A,0)),\"\")","v":""},{"$f":"IFERROR(INDEX(Sept!E:E,MATCH(Year!A:A,Sept!A:A,0)),\"\")","v":""},{"$f":"IFERROR(INDEX(Oct!E:E,MATCH(Year!A:A,Oct!A:A,0)),\"\")","v":""},{"$f":"IFERROR(INDEX(Nov!E:E,MATCH(Year!A:A,Nov!A:A,0)),\"\")","v":""},{"$f":"IFERROR(INDEX(Dec!E:E,MATCH(Year!A:A,Dec!A:A,0)),\"\")","v":""},{"$f":"IFERROR(INDEX(Jan!E:E,MATCH(Year!A:A,Jan!A:A,0)),\"\")","v":""},{"$f":"IFERROR(INDEX(Feb!E:E,MATCH(Year!A:A,Feb!A:A,0)),\"\")","v":""},{"$f":"IFERROR(INDEX(March!E:E,MATCH(Year!A:A,March!A:A,0)),\"\")","v":""},{"$f":"IF(ISERROR((SUM(B174:M174))/B4),\"\",(SUM(B174:M174))/B4)","v":""}]
[{"$f":"IF(ISERROR('Audit questions'!A31),\"\",'Audit questions'!A31)","v":"Test30"},{"$f":"IFERROR(INDEX(April!E:E,MATCH(Year!A:A,April!A:A,0)),\"\")","v":""},{"$f":"IFERROR(INDEX(May!E:E,MATCH(Year!A:A,May!A:A,0)),\"\")","v":""},{"$f":"IFERROR(INDEX(June!E:E,MATCH(Year!A:A,June!A:A,0)),\"\")","v":""},{"$f":"IFERROR(INDEX(July!E:E,MATCH(Year!A:A,July!A:A,0)),\"\")","v":""},{"$f":"IFERROR(INDEX(Aug!E:E,MATCH(Year!A:A,Aug!A:A,0)),\"\")","v":""},{"$f":"IFERROR(INDEX(Sept!E:E,MATCH(Year!A:A,Sept!A:A,0)),\"\")","v":""},{"$f":"IFERROR(INDEX(Oct!E:E,MATCH(Year!A:A,Oct!A:A,0)),\"\")","v":""},{"$f":"IFERROR(INDEX(Nov!E:E,MATCH(Year!A:A,Nov!A:A,0)),\"\")","v":""},{"$f":"IFERROR(INDEX(Dec!E:E,MATCH(Year!A:A,Dec!A:A,0)),\"\")","v":""},{"$f":"IFERROR(INDEX(Jan!E:E,MATCH(Year!A:A,Jan!A:A,0)),\"\")","v":""},{"$f":"IFERROR(INDEX(Feb!E:E,MATCH(Year!A:A,Feb!A:A,0)),\"\")","v":""},{"$f":"IFERROR(INDEX(March!E:E,MATCH(Year!A:A,March!A:A,0)),\"\")","v":""},{"$f":"IF(ISERROR((SUM(B175:M175))/B4),\"\",(SUM(B175:M175))/B4)","v":""}]
[{"$f":"IF(ISERROR('Audit questions'!A32),\"\",'Audit questions'!A32)","v":"Test31"},{"$f":"IFERROR(INDEX(April!E:E,MATCH(Year!A:A,April!A:A,0)),\"\")","v":""},{"$f":"IFERROR(INDEX(May!E:E,MATCH(Year!A:A,May!A:A,0)),\"\")","v":""},{"$f":"IFERROR(INDEX(June!E:E,MATCH(Year!A:A,June!A:A,0)),\"\")","v":""},{"$f":"IFERROR(INDEX(July!E:E,MATCH(Year!A:A,July!A:A,0)),\"\")","v":""},{"$f":"IFERROR(INDEX(Aug!E:E,MATCH(Year!A:A,Aug!A:A,0)),\"\")","v":""},{"$f":"IFERROR(INDEX(Sept!E:E,MATCH(Year!A:A,Sept!A:A,0)),\"\")","v":""},{"$f":"IFERROR(INDEX(Oct!E:E,MATCH(Year!A:A,Oct!A:A,0)),\"\")","v":""},{"$f":"IFERROR(INDEX(Nov!E:E,MATCH(Year!A:A,Nov!A:A,0)),\"\")","v":""},{"$f":"IFERROR(INDEX(Dec!E:E,MATCH(Year!A:A,Dec!A:A,0)),\"\")","v":""},{"$f":"IFERROR(INDEX(Jan!E:E,MATCH(Year!A:A,Jan!A:A,0)),\"\")","v":""},{"$f":"IFERROR(INDEX(Feb!E:E,MATCH(Year!A:A,Feb!A:A,0)),\"\")","v":""},{"$f":"IFERROR(INDEX(March!E:E,MATCH(Year!A:A,March!A:A,0)),\"\")","v":""},{"$f":"IF(ISERROR((SUM(B176:M176))/B4),\"\",(SUM(B176:M176))/B4)","v":""}]
[{"$f":"IF(ISERROR('Audit questions'!A33),\"\",'Audit questions'!A33)","v":"Test32"},{"$f":"IFERROR(INDEX(April!E:E,MATCH(Year!A:A,April!A:A,0)),\"\")","v":""},{"$f":"IFERROR(INDEX(May!E:E,MATCH(Year!A:A,May!A:A,0)),\"\")","v":""},{"$f":"IFERROR(INDEX(June!E:E,MATCH(Year!A:A,June!A:A,0)),\"\")","v":""},{"$f":"IFERROR(INDEX(July!E:E,MATCH(Year!A:A,July!A:A,0)),\"\")","v":""},{"$f":"IFERROR(INDEX(Aug!E:E,MATCH(Year!A:A,Aug!A:A,0)),\"\")","v":""},{"$f":"IFERROR(INDEX(Sept!E:E,MATCH(Year!A:A,Sept!A:A,0)),\"\")","v":""},{"$f":"IFERROR(INDEX(Oct!E:E,MATCH(Year!A:A,Oct!A:A,0)),\"\")","v":""},{"$f":"IFERROR(INDEX(Nov!E:E,MATCH(Year!A:A,Nov!A:A,0)),\"\")","v":""},{"$f":"IFERROR(INDEX(Dec!E:E,MATCH(Year!A:A,Dec!A:A,0)),\"\")","v":""},{"$f":"IFERROR(INDEX(Jan!E:E,MATCH(Year!A:A,Jan!A:A,0)),\"\")","v":""},{"$f":"IFERROR(INDEX(Feb!E:E,MATCH(Year!A:A,Feb!A:A,0)),\"\")","v":""},{"$f":"IFERROR(INDEX(March!E:E,MATCH(Year!A:A,March!A:A,0)),\"\")","v":""},{"$f":"IF(ISERROR((SUM(B177:M177))/B4),\"\",(SUM(B177:M177))/B4)","v":""}]
[{"$f":"IF(ISERROR('Audit questions'!A34),\"\",'Audit questions'!A34)","v":"Test33"},{"$f":"IFERROR(INDEX(April!E:E,MATCH(Year!A:A,April!A:A,0)),\"\")","v":""},{"$f":"IFERROR(INDEX(May!E:E,MATCH(Year!A:A,May!A:A,0)),\"\")","v":""},{"$f":"IFERROR(INDEX(June!E:E,MATCH(Year!A:A,June!A:A,0)),\"\")","v":""},{"$f":"IFERROR(INDEX(July!E:E,MATCH(Year!A:A,July!A:A,0)),\"\")","v":""},{"$f":"IFERROR(INDEX(Aug!E:E,MATCH(Year!A:A,Aug!A:A,0)),\"\")","v":""},{"$f":"IFERROR(INDEX(Sept!E:E,MATCH(Year!A:A,Sept!A:A,0)),\"\")","v":""},{"$f":"IFERROR(INDEX(Oct!E:E,MATCH(Year!A:A,Oct!A:A,0)),\"\")","v":""},{"$f":"IFERROR(INDEX(Nov!E:E,MATCH(Year!A:A,Nov!A:A,0)),\"\")","v":""},{"$f":"IFERROR(INDEX(Dec!E:E,MATCH(Year!A:A,Dec!A:A,0)),\"\")","v":""},{"$f":"IFERROR(INDEX(Jan!E:E,MATCH(Year!A:A,Jan!A:A,0)),\"\")","v":""},{"$f":"IFERROR(INDEX(Feb!E:E,MATCH(Year!A:A,Feb!A:A,0)),\"\")","v":""},{"$f":"IFERROR(INDEX(March!E:E,MATCH(Year!A:A,March!A:A,0)),\"\")","v":""},{"$f":"IF(ISERROR((SUM(B178:M178))/B4),\"\",(SUM(B178:M178))/B4)","v":""}]
[{"$f":"IF(ISERROR('Audit questions'!A35),\"\",'Audit questions'!A35)","v":"Test34"},{"$f":"IFERROR(INDEX(April!E:E,MATCH(Year!A:A,April!A:A,0)),\"\")","v":""},{"$f":"IFERROR(INDEX(May!E:E,MATCH(Year!A:A,May!A:A,0)),\"\")","v":""},{"$f":"IFERROR(INDEX(June!E:E,MATCH(Year!A:A,June!A:A,0)),\"\")","v":""},{"$f":"IFERROR(INDEX(July!E:E,MATCH(Year!A:A,July!A:A,0)),\"\")","v":""},{"$f":"IFERROR(INDEX(Aug!E:E,MATCH(Year!A:A,Aug!A:A,0)),\"\")","v":""},{"$f":"IFERROR(INDEX(Sept!E:E,MATCH(Year!A:A,Sept!A:A,0)),\"\")","v":""},{"$f":"IFERROR(INDEX(Oct!E:E,MATCH(Year!A:A,Oct!A:A,0)),\"\")","v":""},{"$f":"IFERROR(INDEX(Nov!E:E,MATCH(Year!A:A,Nov!A:A,0)),\"\")","v":""},{"$f":"IFERROR(INDEX(Dec!E:E,MATCH(Year!A:A,Dec!A:A,0)),\"\")","v":""},{"$f":"IFERROR(INDEX(Jan!E:E,MATCH(Year!A:A,Jan!A:A,0)),\"\")","v":""},{"$f":"IFERROR(INDEX(Feb!E:E,MATCH(Year!A:A,Feb!A:A,0)),\"\")","v":""},{"$f":"IFERROR(INDEX(March!E:E,MATCH(Year!A:A,March!A:A,0)),\"\")","v":""},{"$f":"IF(ISERROR((SUM(B179:M179))/B4),\"\",(SUM(B179:M179))/B4)","v":""}]
[{"$f":"IF(ISERROR('Audit questions'!A36),\"\",'Audit questions'!A36)","v":"Test35"},{"$f":"IFERROR(INDEX(April!E:E,MATCH(Year!A:A,April!A:A,0)),\"\")","v":""},{"$f":"IFERROR(INDEX(May!E:E,MATCH(Year!A:A,May!A:A,0)),\"\")","v":""},{"$f":"IFERROR(INDEX(June!E:E,MATCH(Year!A:A,June!A:A,0)),\"\")","v":""},{"$f":"IFERROR(INDEX(July!E:E,MATCH(Year!A:A,July!A:A,0)),\"\")","v":""},{"$f":"IFERROR(INDEX(Aug!E:E,MATCH(Year!A:A,Aug!A:A,0)),\"\")","v":""},{"$f":"IFERROR(INDEX(Sept!E:E,MATCH(Year!A:A,Sept!A:A,0)),\"\")","v":""},{"$f":"IFERROR(INDEX(Oct!E:E,MATCH(Year!A:A,Oct!A:A,0)),\"\")","v":""},{"$f":"IFERROR(INDEX(Nov!E:E,MATCH(Year!A:A,Nov!A:A,0)),\"\")","v":""},{"$f":"IFERROR(INDEX(Dec!E:E,MATCH(Year!A:A,Dec!A:A,0)),\"\")","v":""},{"$f":"IFERROR(INDEX(Jan!E:E,MATCH(Year!A:A,Jan!A:A,0)),\"\")","v":""},{"$f":"IFERROR(INDEX(Feb!E:E,MATCH(Year!A:A,Feb!A:A,0)),\"\")","v":""},{"$f":"IFERROR(INDEX(March!E:E,MATCH(Year!A:A,March!A:A,0)),\"\")","v":""},{"$f":"IF(ISERROR((SUM(B180:M180))/B4),\"\",(SUM(B180:M180))/B4)","v":""}]
[{"$f":"IF(ISERROR('Audit questions'!A37),\"\",'Audit questions'!A37)","v":"Test36"},{"$f":"IFERROR(INDEX(April!E:E,MATCH(Year!A:A,April!A:A,0)),\"\")","v":""},{"$f":"IFERROR(INDEX(May!E:E,MATCH(Year!A:A,May!A:A,0)),\"\")","v":""},{"$f":"IFERROR(INDEX(June!E:E,MATCH(Year!A:A,June!A:A,0)),\"\")","v":""},{"$f":"IFERROR(INDEX(July!E:E,MATCH(Year!A:A,July!A:A,0)),\"\")","v":""},{"$f":"IFERROR(INDEX(Aug!E:E,MATCH(Year!A:A,Aug!A:A,0)),\"\")","v":""},{"$f":"IFERROR(INDEX(Sept!E:E,MATCH(Year!A:A,Sept!A:A,0)),\"\")","v":""},{"$f":"IFERROR(INDEX(Oct!E:E,MATCH(Year!A:A,Oct!A:A,0)),\"\")","v":""},{"$f":"IFERROR(INDEX(Nov!E:E,MATCH(Year!A:A,Nov!A:A,0)),\"\")","v":""},{"$f":"IFERROR(INDEX(Dec!E:E,MATCH(Year!A:A,Dec!A:A,0)),\"\")","v":""},{"$f":"IFERROR(INDEX(Jan!E:E,MATCH(Year!A:A,Jan!A:A,0)),\"\")","v":""},{"$f":"IFERROR(INDEX(Feb!E:E,MATCH(Year!A:A,Feb!A:A,0)),\"\")","v":""},{"$f":"IFERROR(INDEX(March!E:E,MATCH(Year!A:A,March!A:A,0)),\"\")","v":""},{"$f":"IF(ISERROR((SUM(B181:M181))/B4),\"\",(SUM(B181:M181))/B4)","v":""}]
[{"$f":"IF(ISERROR('Audit questions'!A38),\"\",'Audit questions'!A38)","v":"Test37"},{"$f":"IFERROR(INDEX(April!E:E,MATCH(Year!A:A,April!A:A,0)),\"\")","v":""},{"$f":"IFERROR(INDEX(May!E:E,MATCH(Year!A:A,May!A:A,0)),\"\")","v":""},{"$f":"IFERROR(INDEX(June!E:E,MATCH(Year!A:A,June!A:A,0)),\"\")","v":""},{"$f":"IFERROR(INDEX(July!E:E,MATCH(Year!A:A,July!A:A,0)),\"\")","v":""},{"$f":"IFERROR(INDEX(Aug!E:E,MATCH(Year!A:A,Aug!A:A,0)),\"\")","v":""},{"$f":"IFERROR(INDEX(Sept!E:E,MATCH(Year!A:A,Sept!A:A,0)),\"\")","v":""},{"$f":"IFERROR(INDEX(Oct!E:E,MATCH(Year!A:A,Oct!A:A,0)),\"\")","v":""},{"$f":"IFERROR(INDEX(Nov!E:E,MATCH(Year!A:A,Nov!A:A,0)),\"\")","v":""},{"$f":"IFERROR(INDEX(Dec!E:E,MATCH(Year!A:A,Dec!A:A,0)),\"\")","v":""},{"$f":"IFERROR(INDEX(Jan!E:E,MATCH(Year!A:A,Jan!A:A,0)),\"\")","v":""},{"$f":"IFERROR(INDEX(Feb!E:E,MATCH(Year!A:A,Feb!A:A,0)),\"\")","v":""},{"$f":"IFERROR(INDEX(March!E:E,MATCH(Year!A:A,March!A:A,0)),\"\")","v":""},{"$f":"IF(ISERROR((SUM(B182:M182))/B4),\"\",(SUM(B182:M182))/B4)","v":""}]
[{"$f":"IF(ISERROR('Audit questions'!A39),\"\",'Audit questions'!A39)","v":"Test38"},{"$f":"IFERROR(INDEX(April!E:E,MATCH(Year!A:A,April!A:A,0)),\"\")","v":""},{"$f":"IFERROR(INDEX(May!E:E,MATCH(Year!A:A,May!A:A,0)),\"\")","v":""},{"$f":"IFERROR(INDEX(June!E:E,MATCH(Year!A:A,June!A:A,0)),\"\")","v":""},{"$f":"IFERROR(INDEX(July!E:E,MATCH(Year!A:A,July!A:A,0)),\"\")","v":""},{"$f":"IFERROR(INDEX(Aug!E:E,MATCH(Year!A:A,Aug!A:A,0)),\"\")","v":""},{"$f":"IFERROR(INDEX(Sept!E:E,MATCH(Year!A:A,Sept!A:A,0)),\"\")","v":""},{"$f":"IFERROR(INDEX(Oct!E:E,MATCH(Year!A:A,Oct!A:A,0)),\"\")","v":""},{"$f":"IFERROR(INDEX(Nov!E:E,MATCH(Year!A:A,Nov!A:A,0)),\"\")","v":""},{"$f":"IFERROR(INDEX(Dec!E:E,MATCH(Year!A:A,Dec!A:A,0)),\"\")","v":""},{"$f":"IFERROR(INDEX(Jan!E:E,MATCH(Year!A:A,Jan!A:A,0)),\"\")","v":""},{"$f":"IFERROR(INDEX(Feb!E:E,MATCH(Year!A:A,Feb!A:A,0)),\"\")","v":""},{"$f":"IFERROR(INDEX(March!E:E,MATCH(Year!A:A,March!A:A,0)),\"\")","v":""},{"$f":"IF(ISERROR((SUM(B183:M183))/B4),\"\",(SUM(B183:M183))/B4)","v":""}]
[{"$f":"IF(ISERROR('Audit questions'!A40),\"\",'Audit questions'!A40)","v":"Test39"},{"$f":"IFERROR(INDEX(April!E:E,MATCH(Year!A:A,April!A:A,0)),\"\")","v":""},{"$f":"IFERROR(INDEX(May!E:E,MATCH(Year!A:A,May!A:A,0)),\"\")","v":""},{"$f":"IFERROR(INDEX(June!E:E,MATCH(Year!A:A,June!A:A,0)),\"\")","v":""},{"$f":"IFERROR(INDEX(July!E:E,MATCH(Year!A:A,July!A:A,0)),\"\")","v":""},{"$f":"IFERROR(INDEX(Aug!E:E,MATCH(Year!A:A,Aug!A:A,0)),\"\")","v":""},{"$f":"IFERROR(INDEX(Sept!E:E,MATCH(Year!A:A,Sept!A:A,0)),\"\")","v":""},{"$f":"IFERROR(INDEX(Oct!E:E,MATCH(Year!A:A,Oct!A:A,0)),\"\")","v":""},{"$f":"IFERROR(INDEX(Nov!E:E,MATCH(Year!A:A,Nov!A:A,0)),\"\")","v":""},{"$f":"IFERROR(INDEX(Dec!E:E,MATCH(Year!A:A,Dec!A:A,0)),\"\")","v":""},{"$f":"IFERROR(INDEX(Jan!E:E,MATCH(Year!A:A,Jan!A:A,0)),\"\")","v":""},{"$f":"IFERROR(INDEX(Feb!E:E,MATCH(Year!A:A,Feb!A:A,0)),\"\")","v":""},{"$f":"IFERROR(INDEX(March!E:E,MATCH(Year!A:A,March!A:A,0)),\"\")","v":""},{"$f":"IF(ISERROR((SUM(B184:M184))/B4),\"\",(SUM(B184:M184))/B4)","v":""}]
[{"$f":"IF(ISERROR('Audit questions'!A41),\"\",'Audit questions'!A41)","v":"Test40"},{"$f":"IFERROR(INDEX(April!E:E,MATCH(Year!A:A,April!A:A,0)),\"\")","v":""},{"$f":"IFERROR(INDEX(May!E:E,MATCH(Year!A:A,May!A:A,0)),\"\")","v":""},{"$f":"IFERROR(INDEX(June!E:E,MATCH(Year!A:A,June!A:A,0)),\"\")","v":""},{"$f":"IFERROR(INDEX(July!E:E,MATCH(Year!A:A,July!A:A,0)),\"\")","v":""},{"$f":"IFERROR(INDEX(Aug!E:E,MATCH(Year!A:A,Aug!A:A,0)),\"\")","v":""},{"$f":"IFERROR(INDEX(Sept!E:E,MATCH(Year!A:A,Sept!A:A,0)),\"\")","v":""},{"$f":"IFERROR(INDEX(Oct!E:E,MATCH(Year!A:A,Oct!A:A,0)),\"\")","v":""},{"$f":"IFERROR(INDEX(Nov!E:E,MATCH(Year!A:A,Nov!A:A,0)),\"\")","v":""},{"$f":"IFERROR(INDEX(Dec!E:E,MATCH(Year!A:A,Dec!A:A,0)),\"\")","v":""},{"$f":"IFERROR(INDEX(Jan!E:E,MATCH(Year!A:A,Jan!A:A,0)),\"\")","v":""},{"$f":"IFERROR(INDEX(Feb!E:E,MATCH(Year!A:A,Feb!A:A,0)),\"\")","v":""},{"$f":"IFERROR(INDEX(March!E:E,MATCH(Year!A:A,March!A:A,0)),\"\")","v":""},{"$f":"IF(ISERROR((SUM(B185:M185))/B4),\"\",(SUM(B185:M185))/B4)","v":""}]
["Average",{"$f":"IF(ISERROR((SUM(B146:B185)/April!B8)),\"\",(SUM(B146:B185)/April!B8))","v":""},{"$f":"IF(ISERROR((SUM(C146:C185)/May!B8)),\"\",(SUM(C146:C185)/May!B8))","v":""},{"$f":"IF(ISERROR((SUM(D146:D185)/June!B8)),\"\",(SUM(D146:D185)/June!B8))","v":""},{"$f":"IF(ISERROR((SUM(E146:E185)/July!B8)),\"\",(SUM(E146:E185)/July!B8))","v":""},{"$f":"IF(ISERROR((SUM(F146:F185)/Aug!B8)),\"\",(SUM(F146:F185)/Aug!B8))","v":""},{"$f":"IF(ISERROR((SUM(G146:G185)/Sept!B8)),\"\",(SUM(G146:G185)/Sept!B8))","v":""},{"$f":"IF(ISERROR((SUM(H146:H185)/Oct!B8)),\"\",(SUM(H146:H185)/Oct!B8))","v":""},{"$f":"IF(ISERROR((SUM(I146:I185)/Nov!B8)),\"\",(SUM(I146:I185)/Nov!B8))","v":""},{"$f":"IF(ISERROR((SUM(J146:J185)/Dec!B8)),\"\",(SUM(J146:J185)/Dec!B8))","v":""},{"$f":"IF(ISERROR((SUM(K146:K185)/Jan!B8)),\"\",(SUM(K146:K185)/Jan!B8))","v":""},{"$f":"IF(ISERROR((SUM(L146:L185)/Feb!B8)),\"\",(SUM(L146:L185)/Feb!B8))","v":""},{"$f":"IF(ISERROR((SUM(M146:M185)/March!B8)),\"\",(SUM(M146:M185)/March!B8))","v":""}]

{"sheet":"Process Updates","index":4,"n_rows":59,"n_cols":2,"rows_kept":59,"cut":false,"hidden":false,"merged":[[24,1,26,8],[1,1,1,8],[4,1,6,8],[9,1,11,8],[14,1,16,8],[19,1,21,8],[59,1,61,8],[29,1,31,8],[34,1,36,8],[39,1,41,8],[44,1,46,8],[49,1,51,8],[54,1,56,8]]}
[]
[null,"Please detail any changes made to the audited process (following each audit) below:"]
[]
[null,"April:"]
[null,"e.g:extra option added to notes template"]
[]
[]
[]
[null,"May:"]
[]
[]
[]
[]
[null,"June:"]
[]
[]
[]
[]
[null,"July:"]
[]
[]
[]
[]
[null,"August:"]
[]
[]
[]
[]
[null,"September:"]
[]
[]
[]
[]
[null,"October:"]
[]
[]
[]
[]
[null,"November:"]
[]
[]
[]
[]
[null,"December:"]
[]
[]
[]
[]
[null,"January:"]
[]
[]
[]
[]
[null,"February:"]
[]
[]
[]
[]
[null,"March:"]

{"sheet":"Graphs","index":5,"n_rows":18,"n_cols":2,"rows_kept":18,"cut":false,"hidden":false,"merged":[]}
[]
[]
[]
[]
[]
[]
[]
[]
[]
[]
[]
[]
[]
[]
[]
[]
[]
[null,"Questions listed can be filtered by clicking on the graph & selecting the filter Icon"]

{"sheet":"April","index":6,"n_rows":51,"n_cols":8,"rows_kept":51,"cut":false,"hidden":false,"merged":[]}
["Click here to go to year overview"]
[]
["Date",null,null,"Total by Apt type"]
["Completed by",null,null,"New",{"$f":"COUNTIF('Apr-Raw'!E3:E103,\"New\")","v":0}]
["Sample group size",{"$f":"COUNTA('Apr-Raw'!A:A)-2","v":0},null,"Follow up",{"$f":"COUNTIF('Apr-Raw'!E3:E103,\"Fup\")","v":0},null,null,{"$f":"Year!H5","v":0.95}]
["Overall Result (compliant only)",{"$f":"IF(ISERROR(SUM(C11:C50)/G51),\"\",SUM(C11:C50)/G51)","v":""},null,"Total by apt Code",null,null,null,{"$f":"Year!H6","v":"80-95%"}]
["Overall Result (compliant & Justified)",{"$f":"IF(ISERROR(SUM(B11:B50)/G51),\"\",SUM(B11:B50)/G51)","v":""},null,"code goes in here",{"$f":"COUNTIF('Apr-Raw'!F3:F103,D7)","v":0},null,null,{"$f":"Year!H7","v":0.8}]
["viable qs",{"$f":"G51","v":0}]
[]
["Metric","Compliant + Justified","Compliant","Justified","Not compliant","Irritating math"]
[{"$f":"IF(ISERROR('Audit questions'!A2),\"\",'Audit questions'!A2)","v":"Test1"},{"$f":"IF(ISERROR(C11+D11),\"\",C11+D11)","v":""},{"$f":"'Apr-Data'!B10","v":""},{"$f":"'Apr-Data'!B12","v":""},{"$f":"'Apr-Data'!B11","v":""},{"$f":"COUNTIF(C11:E11,\">0\")","v":0}]
[{"$f":"IF(ISERROR('Audit questions'!A3),\"\",'Audit questions'!A3)","v":"Test2"},"",{"$f":"'Apr-Data'!C10","v":""},{"$f":"'Apr-Data'!C12","v":""},{"$f":"'Apr-Data'!C11","v":""},0]
[{"$f":"IF(ISERROR('Audit questions'!A4),\"\",'Audit questions'!A4)","v":"Test3"},"",{"$f":"'Apr-Data'!D10","v":""},{"$f":"'Apr-Data'!D12","v":""},{"$f":"'Apr-Data'!D11","v":""},0]
[{"$f":"IF(ISERROR('Audit questions'!A5),\"\",'Audit questions'!A5)","v":"Test4"},"",{"$f":"'Apr-Data'!E10","v":""},{"$f":"'Apr-Data'!E12","v":""},{"$f":"'Apr-Data'!E11","v":""},0]
[{"$f":"IF(ISERROR('Audit questions'!A6),\"\",'Audit questions'!A6)","v":"Test5"},"",{"$f":"'Apr-Data'!F10","v":""},{"$f":"'Apr-Data'!F12","v":""},{"$f":"'Apr-Data'!F11","v":""},0]
[{"$f":"IF(ISERROR('Audit questions'!A7),\"\",'Audit questions'!A7)","v":"Test6"},"",{"$f":"'Apr-Data'!G10","v":""},{"$f":"'Apr-Data'!G12","v":""},{"$f":"'Apr-Data'!G11","v":""},0]
[{"$f":"IF(ISERROR('Audit questions'!A8),\"\",'Audit questions'!A8)","v":"Test7"},"",{"$f":"'Apr-Data'!H10","v":""},{"$f":"'Apr-Data'!H12","v":""},{"$f":"'Apr-Data'!H11","v":""},0]
[{"$f":"IF(ISERROR('Audit questions'!A9),\"\",'Audit questions'!A9)","v":"Test8"},"",{"$f":"'Apr-Data'!I10","v":""},{"$f":"'Apr-Data'!I12","v":""},{"$f":"'Apr-Data'!I11","v":""},0]
[{"$f":"IF(ISERROR('Audit questions'!A10),\"\",'Audit questions'!A10)","v":"Test9"},"",{"$f":"'Apr-Data'!J10","v":""},{"$f":"'Apr-Data'!J12","v":""},{"$f":"'Apr-Data'!J11","v":""},0]
[{"$f":"IF(ISERROR('Audit questions'!A11),\"\",'Audit questions'!A11)","v":"Test10"},"",{"$f":"'Apr-Data'!K10","v":""},{"$f":"'Apr-Data'!K12","v":""},{"$f":"'Apr-Data'!K11","v":""},0]
[{"$f":"IF(ISERROR('Audit questions'!A12),\"\",'Audit questions'!A12)","v":"Test11"},"",{"$f":"'Apr-Data'!L10","v":""},{"$f":"'Apr-Data'!L12","v":""},{"$f":"'Apr-Data'!L11","v":""},0]
[{"$f":"IF(ISERROR('Audit questions'!A13),\"\",'Audit questions'!A13)","v":"Test12"},"",{"$f":"'Apr-Data'!M10","v":""},{"$f":"'Apr-Data'!M12","v":""},{"$f":"'Apr-Data'!M11","v":""},0]
[{"$f":"IF(ISERROR('Audit questions'!A14),\"\",'Audit questions'!A14)","v":"Test13"},"",{"$f":"'Apr-Data'!N10","v":""},{"$f":"'Apr-Data'!N12","v":""},{"$f":"'Apr-Data'!N11","v":""},0]
[{"$f":"IF(ISERROR('Audit questions'!A15),\"\",'Audit questions'!A15)","v":"Test14"},"",{"$f":"'Apr-Data'!O10","v":""},{"$f":"'Apr-Data'!O12","v":""},{"$f":"'Apr-Data'!O11","v":""},0]
[{"$f":"IF(ISERROR('Audit questions'!A16),\"\",'Audit questions'!A16)","v":"Test15"},"",{"$f":"'Apr-Data'!P10","v":""},{"$f":"'Apr-Data'!P12","v":""},{"$f":"'Apr-Data'!P11","v":""},0]
[{"$f":"IF(ISERROR('Audit questions'!A17),\"\",'Audit questions'!A17)","v":"Test16"},"",{"$f":"'Apr-Data'!Q10","v":""},{"$f":"'Apr-Data'!Q12","v":""},{"$f":"'Apr-Data'!Q11","v":""},0]
[{"$f":"IF(ISERROR('Audit questions'!A18),\"\",'Audit questions'!A18)","v":"Test17"},"",{"$f":"'Apr-Data'!R10","v":""},{"$f":"'Apr-Data'!R12","v":""},{"$f":"'Apr-Data'!R11","v":""},0]
[{"$f":"IF(ISERROR('Audit questions'!A19),\"\",'Audit questions'!A19)","v":"Test18"},"",{"$f":"'Apr-Data'!S10","v":""},{"$f":"'Apr-Data'!S12","v":""},{"$f":"'Apr-Data'!S11","v":""},0]
[{"$f":"IF(ISERROR('Audit questions'!A20),\"\",'Audit questions'!A20)","v":"Test19"},"",{"$f":"'Apr-Data'!T10","v":""},{"$f":"'Apr-Data'!T12","v":""},{"$f":"'Apr-Data'!T11","v":""},0]
[{"$f":"IF(ISERROR('Audit questions'!A21),\"\",'Audit questions'!A21)","v":"Test20"},"",{"$f":"'Apr-Data'!U10","v":""},{"$f":"'Apr-Data'!U12","v":""},{"$f":"'Apr-Data'!U11","v":""},0]
[{"$f":"IF(ISERROR('Audit questions'!A22),\"\",'Audit questions'!A22)","v":"Test21"},"",{"$f":"'Apr-Data'!V10","v":""},{"$f":"'Apr-Data'!V12","v":""},{"$f":"'Apr-Data'!V11","v":""},0]
[{"$f":"IF(ISERROR('Audit questions'!A23),\"\",'Audit questions'!A23)","v":"Test22"},"",{"$f":"'Apr-Data'!W10","v":""},{"$f":"'Apr-Data'!W12","v":""},{"$f":"'Apr-Data'!W11","v":""},0]
[{"$f":"IF(ISERROR('Audit questions'!A24),\"\",'Audit questions'!A24)","v":"Test23"},"",{"$f":"'Apr-Data'!X10","v":""},{"$f":"'Apr-Data'!X12","v":""},{"$f":"'Apr-Data'!X11","v":""},0]
[{"$f":"IF(ISERROR('Audit questions'!A25),\"\",'Audit questions'!A25)","v":"Test24"},"",{"$f":"'Apr-Data'!Y10","v":""},{"$f":"'Apr-Data'!Y12","v":""},{"$f":"'Apr-Data'!Y11","v":""},0]
[{"$f":"IF(ISERROR('Audit questions'!A26),\"\",'Audit questions'!A26)","v":"Test25"},"",{"$f":"'Apr-Data'!Z10","v":""},{"$f":"'Apr-Data'!Z12","v":""},{"$f":"'Apr-Data'!Z11","v":""},0]
[{"$f":"IF(ISERROR('Audit questions'!A27),\"\",'Audit questions'!A27)","v":"Test26"},"",{"$f":"'Apr-Data'!AA10","v":""},{"$f":"'Apr-Data'!AA12","v":""},{"$f":"'Apr-Data'!AA11","v":""},0]
[{"$f":"IF(ISERROR('Audit questions'!A28),\"\",'Audit questions'!A28)","v":"Test27"},"",{"$f":"'Apr-Data'!AB10","v":""},{"$f":"'Apr-Data'!AB12","v":""},{"$f":"'Apr-Data'!AB11","v":""},0]
[{"$f":"IF(ISERROR('Audit questions'!A29),\"\",'Audit questions'!A29)","v":"Test28"},"",{"$f":"'Apr-Data'!AC10","v":""},{"$f":"'Apr-Data'!AC12","v":""},{"$f":"'Apr-Data'!AC11","v":""},0]
[{"$f":"IF(ISERROR('Audit questions'!A30),\"\",'Audit questions'!A30)","v":"Test29"},"",{"$f":"'Apr-Data'!AD10","v":""},{"$f":"'Apr-Data'!AD12","v":""},{"$f":"'Apr-Data'!AD11","v":""},0]
[{"$f":"IF(ISERROR('Audit questions'!A31),\"\",'Audit questions'!A31)","v":"Test30"},"",{"$f":"'Apr-Data'!AE10","v":""},{"$f":"'Apr-Data'!AE12","v":""},{"$f":"'Apr-Data'!AE11","v":""},0]
[{"$f":"IF(ISERROR('Audit questions'!A32),\"\",'Audit questions'!A32)","v":"Test31"},"",{"$f":"'Apr-Data'!AF10","v":""},{"$f":"'Apr-Data'!AF12","v":""},{"$f":"'Apr-Data'!AF11","v":""},0]
[{"$f":"IF(ISERROR('Audit questions'!A33),\"\",'Audit questions'!A33)","v":"Test32"},"",{"$f":"'Apr-Data'!AG10","v":""},{"$f":"'Apr-Data'!AG12","v":""},{"$f":"'Apr-Data'!AG11","v":""},0]
[{"$f":"IF(ISERROR('Audit questions'!A34),\"\",'Audit questions'!A34)","v":"Test33"},"",{"$f":"'Apr-Data'!AH10","v":""},{"$f":"'Apr-Data'!AH12","v":""},{"$f":"'Apr-Data'!AH11","v":""},0]
[{"$f":"IF(ISERROR('Audit questions'!A35),\"\",'Audit questions'!A35)","v":"Test34"},"",{"$f":"'Apr-Data'!AI10","v":""},{"$f":"'Apr-Data'!AI12","v":""},{"$f":"'Apr-Data'!AI11","v":""},0]
[{"$f":"IF(ISERROR('Audit questions'!A36),\"\",'Audit questions'!A36)","v":"Test35"},"",{"$f":"'Apr-Data'!AJ10","v":""},{"$f":"'Apr-Data'!AJ12","v":""},{"$f":"'Apr-Data'!AJ11","v":""},0]
[{"$f":"IF(ISERROR('Audit questions'!A37),\"\",'Audit questions'!A37)","v":"Test36"},"",{"$f":"'Apr-Data'!AK10","v":""},{"$f":"'Apr-Data'!AK12","v":""},{"$f":"'Apr-Data'!AK11","v":""},0]
[{"$f":"IF(ISERROR('Audit questions'!A38),\"\",'Audit questions'!A38)","v":"Test37"},"",{"$f":"'Apr-Data'!AL10","v":""},{"$f":"'Apr-Data'!AL12","v":""},{"$f":"'Apr-Data'!AL11","v":""},0]
[{"$f":"IF(ISERROR('Audit questions'!A39),\"\",'Audit questions'!A39)","v":"Test38"},"",{"$f":"'Apr-Data'!AM10","v":""},{"$f":"'Apr-Data'!AM12","v":""},{"$f":"'Apr-Data'!AM11","v":""},0]
[{"$f":"IF(ISERROR('Audit questions'!A40),\"\",'Audit questions'!A40)","v":"Test39"},"",{"$f":"'Apr-Data'!AN10","v":""},{"$f":"'Apr-Data'!AN12","v":""},{"$f":"'Apr-Data'!AN11","v":""},0]
[{"$f":"IF(ISERROR('Audit questions'!A41),\"\",'Audit questions'!A41)","v":"Test40"},"",{"$f":"'Apr-Data'!AO10","v":""},{"$f":"'Apr-Data'!AO12","v":""},{"$f":"'Apr-Data'!AO11","v":""},0]
[null,null,null,null,null,null,{"$f":"COUNTIF(F11:F50,\">=1\")","v":0}]

{"sheet":"Apr-Raw","index":7,"n_rows":7,"n_cols":87,"rows_kept":7,"cut":false,"hidden":true,"merged":[[0,85,0,86],[0,63,0,64],[0,65,0,66],[0,67,0,68],[0,69,0,70],[0,71,0,72],[0,73,0,74],[0,75,0,76],[0,77,0,78],[0,79,0,80],[0,81,0,82],[0,83,0,84],[0,61,0,62],[0,39,0,40],[0,41,0,42],[0,43,0,44],[0,45,0,46],[0,47,0,48],[0,49,0,50],[0,51,0,52],[0,53,0,54],[0,55,0,56],[0,57,0,58],[0,59,0,60],[0,37,0,38],[0,15,0,16],[0,17,0,18],[0,19,0,20],[0,21,0,22],[0,23,0,24],[0,25,0,26],[0,27,0,28],[0,29,0,30],[0,31,0,32],[0,33,0,34],[0,35,0,36],[0,13,0,14],[0,0,0,5],[0,6,1,6],[0,7,0,8],[0,9,0,10],[0,11,0,12]]}
["Record details",null,null,null,null,null,"Notes",{"$f":"'Audit questions'!A2","v":"Test1"},null,{"$f":"'Audit questions'!A3","v":"Test2"},null,{"$f":"'Audit questions'!A4","v":"Test3"},null,{"$f":"'Audit questions'!A5","v":"Test4"},null,{"$f":"'Audit questions'!A6","v":"Test5"},null,{"$f":"'Audit questions'!A7","v":"Test6"},null,{"$f":"'Audit questions'!A8","v":"Test7"},null,{"$f":"'Audit questions'!A9","v":"Test8"},null,{"$f":"'Audit questions'!A10","v":"Test9"},null,{"$f":"'Audit questions'!A11","v":"Test10"},null,{"$f":"'Audit questions'!A12","v":"Test11"},null,{"$f":"'Audit questions'!A13","v":"Test12"},null,{"$f":"'Audit questions'!A14","v":"Test13"},null,{"$f":"'Audit questions'!A15","v":"Test14"},null,{"$f":"'Audit questions'!A16","v":"Test15"},null,{"$f":"'Audit questions'!A17","v":"Test16"},null,{"$f":"'Audit questions'!A18","v":"Test17"},null,{"$f":"'Audit questions'!A19","v":"Test18"},null,{"$f":"'Audit questions'!A20","v":"Test19"},null,{"$f":"'Audit questions'!A21","v":"Test20"},null,{"$f":"'Audit questions'!A22","v":"Test21"},null,{"$f":"'Audit questions'!A23","v":"Test22"},null,{"$f":"'Audit questions'!A24","v":"Test23"},null,{"$f":"'Audit questions'!A25","v":"Test24"},null,{"$f":"'Audit questions'!A26","v":"Test25"},null,{"$f":"'Audit questions'!A27","v":"Test26"},null,{"$f":"'Audit questions'!A28","v":"Test27"},null,{"$f":"'Audit questions'!A29","v":"Test28"},null,{"$f":"'Audit questions'!A30","v":"Test29"},null,{"$f":"'Audit questions'!A31","v":"Test30"},null,{"$f":"'Audit questions'!A32","v":"Test31"},null,{"$f":"'Audit questions'!A33","v":"Test32"},null,{"$f":"'Audit questions'!A34","v":"Test33"},null,{"$f":"'Audit questions'!A35","v":"Test34"},null,{"$f":"'Audit questions'!A36","v":"Test35"},null,{"$f":"'Audit questions'!A37","v":"Test36"},null,{"$f":"'Audit questions'!A38","v":"Test37"},null,{"$f":"'Audit questions'!A39","v":"Test38"},null,{"$f":"'Audit questions'!A40","v":"Test39"},null,{"$f":"'Audit questions'!A41","v":"Test40"}]
["Pt number","Date seen","Clinician 1","clinician 2","New/ F-up","Apt code",null,"Compliant?","Other result","Compliant?","Other result","Compliant?","Other result","Compliant?","Other result","Compliant?","Other result","Compliant?","Other result","Compliant?","Other result","Compliant?","Other result","Compliant?","Other result","Compliant?","Other result","Compliant?","Other result","Compliant?","Other result","Compliant?","Other result","Compliant?","Other result","Compliant?","Other result","Compliant?","Other result","Compliant?","Other result","Compliant?","Other result","Compliant?","Other result","Compliant?","Other result","Compliant?","Other result","Compliant?","Other result","Compliant?","Other result","Compliant?","Other result","Compliant?","Other result","Compliant?","Other result","Compliant?","Other result","Compliant?","Other result","Compliant?","Other result","Compliant?","Other result","Compliant?","Other result","Compliant?","Other result","Compliant?","Other result","Compliant?","Other result","Compliant?","Other result","Compliant?","Other result","Compliant?","Other result","Compliant?","Other result","Compliant?","Other result","Compliant?","Other result"]
[null," "]
[null," "]
[null," "]
[null," "]
[null," "]

{"sheet":"Apr-Data","index":8,"n_rows":12,"n_cols":41,"rows_kept":12,"cut":false,"hidden":true,"merged":[[0,0,1,0]]}
["Results",{"$f":"'Audit questions'!A2","v":"Test1"},{"$f":"'Audit questions'!A3","v":"Test2"},{"$f":"'Audit questions'!A4","v":"Test3"},{"$f":"'Audit questions'!A5","v":"Test4"},{"$f":"'Audit questions'!A6","v":"Test5"},{"$f":"'Audit questions'!A7","v":"Test6"},{"$f":"'Audit questions'!A8","v":"Test7"},{"$f":"'Audit questions'!A9","v":"Test8"},{"$f":"'Audit questions'!A10","v":"Test9"},{"$f":"'Audit questions'!A11","v":"Test10"},{"$f":"'Audit questions'!A12","v":"Test11"},{"$f":"'Audit questions'!A13","v":"Test12"},{"$f":"'Audit questions'!A14","v":"Test13"},{"$f":"'Audit questions'!A15","v":"Test14"},{"$f":"'Audit questions'!A16","v":"Test15"},{"$f":"'Audit questions'!A17","v":"Test16"},{"$f":"'Audit questions'!A18","v":"Test17"},{"$f":"'Audit questions'!A19","v":"Test18"},{"$f":"'Audit questions'!A20","v":"Test19"},{"$f":"'Audit questions'!A21","v":"Test20"},{"$f":"'Audit questions'!A22","v":"Test21"},{"$f":"'Audit questions'!A23","v":"Test22"},{"$f":"'Audit questions'!A24","v":"Test23"},{"$f":"'Audit questions'!A25","v":"Test24"},{"$f":"'Audit questions'!A26","v":"Test25"},{"$f":"'Audit questions'!A27","v":"Test26"},{"$f":"'Audit questions'!A28","v":"Test27"},{"$f":"'Audit questions'!A29","v":"Test28"},{"$f":"'Audit questions'!A30","v":"Test29"},{"$f":"'Audit questions'!A31","v":"Test30"},{"$f":"'Audit questions'!A32","v":"Test31"},{"$f":"'Audit questions'!A33","v":"Test32"},{"$f":"'Audit questions'!A34","v":"Test33"},{"$f":"'Audit questions'!A35","v":"Test34"},{"$f":"'Audit questions'!A36","v":"Test35"},{"$f":"'Audit questions'!A37","v":"Test36"},{"$f":"'Audit questions'!A38","v":"Test37"},{"$f":"'Audit questions'!A39","v":"Test38"},{"$f":"'Audit questions'!A40","v":"Test39"},{"$f":"'Audit questions'!A41","v":"Test40"}]
[null,"Compliant?","Compliant?","Compliant?","Compliant?","Compliant?","Compliant?","Compliant?","Compliant?","Compliant?","Compliant?","Compliant?","Compliant?","Compliant?","Compliant?","Compliant?","Compliant?","Compliant?","Compliant?","Compliant?","Compliant?","Compliant?","Compliant?","Compliant?","Compliant?","Compliant?","Compliant?","Compliant?","Compliant?","Compliant?","Compliant?","Compliant?","Compliant?","Compliant?","Compliant?","Compliant?","Compliant?","Compliant?","Compliant?","Compliant?","Compliant?"]
["Total Y",{"$f":"COUNTIF('Apr-Raw'!H:H,\"yes\")","v":0},{"$f":"COUNTIF('Apr-Raw'!J:J,\"yes\")","v":0},{"$f":"COUNTIF('Apr-Raw'!L:L,\"yes\")","v":0},{"$f":"COUNTIF('Apr-Raw'!N:N,\"yes\")","v":0},{"$f":"COUNTIF('Apr-Raw'!P:P,\"yes\")","v":0},{"$f":"COUNTIF('Apr-Raw'!R:R,\"yes\")","v":0},{"$f":"COUNTIF('Apr-Raw'!T:T,\"yes\")","v":0},{"$f":"COUNTIF('Apr-Raw'!V:V,\"yes\")","v":0},{"$f":"COUNTIF('Apr-Raw'!X:X,\"yes\")","v":0},{"$f":"COUNTIF('Apr-Raw'!Z:Z,\"yes\")","v":0},{"$f":"COUNTIF('Apr-Raw'!AB:AB,\"yes\")","v":0},{"$f":"COUNTIF('Apr-Raw'!AD:AD,\"yes\")","v":0},{"$f":"COUNTIF('Apr-Raw'!AF:AF,\"yes\")","v":0},{"$f":"COUNTIF('Apr-Raw'!AH:AH,\"yes\")","v":0},{"$f":"COUNTIF('Apr-Raw'!AJ:AJ,\"yes\")","v":0},{"$f":"COUNTIF('Apr-Raw'!AL:AL,\"yes\")","v":0},{"$f":"COUNTIF('Apr-Raw'!AN:AN,\"yes\")","v":0},{"$f":"COUNTIF('Apr-Raw'!AP:AP,\"yes\")","v":0},{"$f":"COUNTIF('Apr-Raw'!AR:AR,\"yes\")","v":0},{"$f":"COUNTIF('Apr-Raw'!AT:AT,\"yes\")","v":0},{"$f":"COUNTIF('Apr-Raw'!AV:AV,\"yes\")","v":0},{"$f":"COUNTIF('Apr-Raw'!AX:AX,\"yes\")","v":0},{"$f":"COUNTIF('Apr-Raw'!AZ:AZ,\"yes\")","v":0},{"$f":"COUNTIF('Apr-Raw'!BB:BB,\"yes\")","v":0},{"$f":"COUNTIF('Apr-Raw'!BD:BD,\"yes\")","v":0},{"$f":"COUNTIF('Apr-Raw'!BF:BF,\"yes\")","v":0},{"$f":"COUNTIF('Apr-Raw'!BH:BH,\"yes\")","v":0},{"$f":"COUNTIF('Apr-Raw'!BJ:BJ,\"yes\")","v":0},{"$f":"COUNTIF('Apr-Raw'!BL:BL,\"yes\")","v":0},{"$f":"COUNTIF('Apr-Raw'!BN:BN,\"yes\")","v":0},{"$f":"COUNTIF('Apr-Raw'!BP:BP,\"yes\")","v":0},{"$f":"COUNTIF('Apr-Raw'!BR:BR,\"yes\")","v":0},{"$f":"COUNTIF('Apr-Raw'!BT:BT,\"yes\")","v":0},{"$f":"COUNTIF('Apr-Raw'!BV:BV,\"yes\")","v":0},{"$f":"COUNTIF('Apr-Raw'!BX:BX,\"yes\")","v":0},{"$f":"COUNTIF('Apr-Raw'!BZ:BZ,\"yes\")","v":0},{"$f":"COUNTIF('Apr-Raw'!CB:CB,\"yes\")","v":0},{"$f":"COUNTIF('Apr-Raw'!CD:CD,\"yes\")","v":0},{"$f":"COUNTIF('Apr-Raw'!CF:CF,\"yes\")","v":0},{"$f":"COUNTIF('Apr-Raw'!CH:CH,\"yes\")","v":0}]
["Total N",{"$f":"COUNTIF('Apr-Raw'!H:H,\"no\")","v":0},{"$f":"COUNTIF('Apr-Raw'!J:J,\"no\")","v":0},{"$f":"COUNTIF('Apr-Raw'!L:L,\"no\")","v":0},{"$f":"COUNTIF('Apr-Raw'!N:N,\"no\")","v":0},{"$f":"COUNTIF('Apr-Raw'!P:P,\"no\")","v":0},{"$f":"COUNTIF('Apr-Raw'!R:R,\"no\")","v":0},{"$f":"COUNTIF('Apr-Raw'!T:T,\"no\")","v":0},{"$f":"COUNTIF('Apr-Raw'!V:V,\"no\")","v":0},{"$f":"COUNTIF('Apr-Raw'!X:X,\"no\")","v":0},{"$f":"COUNTIF('Apr-Raw'!Z:Z,\"no\")","v":0},{"$f":"COUNTIF('Apr-Raw'!AB:AB,\"no\")","v":0},{"$f":"COUNTIF('Apr-Raw'!AD:AD,\"no\")","v":0},{"$f":"COUNTIF('Apr-Raw'!AF:AF,\"no\")","v":0},{"$f":"COUNTIF('Apr-Raw'!AH:AH,\"no\")","v":0},{"$f":"COUNTIF('Apr-Raw'!AJ:AJ,\"no\")","v":0},{"$f":"COUNTIF('Apr-Raw'!AL:AL,\"no\")","v":0},{"$f":"COUNTIF('Apr-Raw'!AN:AN,\"no\")","v":0},{"$f":"COUNTIF('Apr-Raw'!AP:AP,\"no\")","v":0},{"$f":"COUNTIF('Apr-Raw'!AR:AR,\"no\")","v":0},{"$f":"COUNTIF('Apr-Raw'!AT:AT,\"no\")","v":0},{"$f":"COUNTIF('Apr-Raw'!AV:AV,\"no\")","v":0},{"$f":"COUNTIF('Apr-Raw'!AX:AX,\"no\")","v":0},{"$f":"COUNTIF('Apr-Raw'!AZ:AZ,\"no\")","v":0},{"$f":"COUNTIF('Apr-Raw'!BB:BB,\"no\")","v":0},{"$f":"COUNTIF('Apr-Raw'!BD:BD,\"no\")","v":0},{"$f":"COUNTIF('Apr-Raw'!BF:BF,\"no\")","v":0},{"$f":"COUNTIF('Apr-Raw'!BH:BH,\"no\")","v":0},{"$f":"COUNTIF('Apr-Raw'!BJ:BJ,\"no\")","v":0},{"$f":"COUNTIF('Apr-Raw'!BL:BL,\"no\")","v":0},{"$f":"COUNTIF('Apr-Raw'!BN:BN,\"no\")","v":0},{"$f":"COUNTIF('Apr-Raw'!BP:BP,\"no\")","v":0},{"$f":"COUNTIF('Apr-Raw'!BR:BR,\"no\")","v":0},{"$f":"COUNTIF('Apr-Raw'!BT:BT,\"no\")","v":0},{"$f":"COUNTIF('Apr-Raw'!BV:BV,\"no\")","v":0},{"$f":"COUNTIF('Apr-Raw'!BX:BX,\"no\")","v":0},{"$f":"COUNTIF('Apr-Raw'!BZ:BZ,\"no\")","v":0},{"$f":"COUNTIF('Apr-Raw'!CB:CB,\"no\")","v":0},{"$f":"COUNTIF('Apr-Raw'!CD:CD,\"no\")","v":0},{"$f":"COUNTIF('Apr-Raw'!CF:CF,\"no\")","v":0},{"$f":"COUNTIF('Apr-Raw'!CH:CH,\"no\")","v":0}]
["Total Justified",{"$f":"COUNTIF('Apr-Raw'!H:H,\"Justified\")","v":0},{"$f":"COUNTIF('Apr-Raw'!J:J,\"Justified\")","v":0},{"$f":"COUNTIF('Apr-Raw'!L:L,\"Justified\")","v":0},{"$f":"COUNTIF('Apr-Raw'!N:N,\"Justified\")","v":0},{"$f":"COUNTIF('Apr-Raw'!P:P,\"Justified\")","v":0},{"$f":"COUNTIF('Apr-Raw'!R:R,\"Justified\")","v":0},{"$f":"COUNTIF('Apr-Raw'!T:T,\"Justified\")","v":0},{"$f":"COUNTIF('Apr-Raw'!V:V,\"Justified\")","v":0},{"$f":"COUNTIF('Apr-Raw'!X:X,\"Justified\")","v":0},{"$f":"COUNTIF('Apr-Raw'!Z:Z,\"Justified\")","v":0},{"$f":"COUNTIF('Apr-Raw'!AB:AB,\"Justified\")","v":0},{"$f":"COUNTIF('Apr-Raw'!AD:AD,\"Justified\")","v":0},{"$f":"COUNTIF('Apr-Raw'!AF:AF,\"Justified\")","v":0},{"$f":"COUNTIF('Apr-Raw'!AH:AH,\"Justified\")","v":0},{"$f":"COUNTIF('Apr-Raw'!AJ:AJ,\"Justified\")","v":0},{"$f":"COUNTIF('Apr-Raw'!AL:AL,\"Justified\")","v":0},{"$f":"COUNTIF('Apr-Raw'!AN:AN,\"Justified\")","v":0},{"$f":"COUNTIF('Apr-Raw'!AP:AP,\"Justified\")","v":0},{"$f":"COUNTIF('Apr-Raw'!AR:AR,\"Justified\")","v":0},{"$f":"COUNTIF('Apr-Raw'!AT:AT,\"Justified\")","v":0},{"$f":"COUNTIF('Apr-Raw'!AV:AV,\"Justified\")","v":0},{"$f":"COUNTIF('Apr-Raw'!AX:AX,\"Justified\")","v":0},{"$f":"COUNTIF('Apr-Raw'!AZ:AZ,\"Justified\")","v":0},{"$f":"COUNTIF('Apr-Raw'!BB:BB,\"Justified\")","v":0},{"$f":"COUNTIF('Apr-Raw'!BD:BD,\"Justified\")","v":0},{"$f":"COUNTIF('Apr-Raw'!BF:BF,\"Justified\")","v":0},{"$f":"COUNTIF('Apr-Raw'!BH:BH,\"Justified\")","v":0},{"$f":"COUNTIF('Apr-Raw'!BJ:BJ,\"Justified\")","v":0},{"$f":"COUNTIF('Apr-Raw'!BL:BL,\"Justified\")","v":0},{"$f":"COUNTIF('Apr-Raw'!BN:BN,\"Justified\")","v":0},{"$f":"COUNTIF('Apr-Raw'!BP:BP,\"Justified\")","v":0},{"$f":"COUNTIF('Apr-Raw'!BR:BR,\"Justified\")","v":0},{"$f":"COUNTIF('Apr-Raw'!BT:BT,\"Justified\")","v":0},{"$f":"COUNTIF('Apr-Raw'!BV:BV,\"Justified\")","v":0},{"$f":"COUNTIF('Apr-Raw'!BX:BX,\"Justified\")","v":0},{"$f":"COUNTIF('Apr-Raw'!BZ:BZ,\"Justified\")","v":0},{"$f":"COUNTIF('Apr-Raw'!CB:CB,\"Justified\")","v":0},{"$f":"COUNTIF('Apr-Raw'!CD:CD,\"Justified\")","v":0},{"$f":"COUNTIF('Apr-Raw'!CF:CF,\"Justified\")","v":0},{"$f":"COUNTIF('Apr-Raw'!CH:CH,\"Justified\")","v":0}]
["Total NA",{"$f":"COUNTIF('Apr-Raw'!H:H,\"NA\")","v":0},{"$f":"COUNTIF('Apr-Raw'!J:J,\"NA\")","v":0},{"$f":"COUNTIF('Apr-Raw'!L:L,\"NA\")","v":0},{"$f":"COUNTIF('Apr-Raw'!N:N,\"NA\")","v":0},{"$f":"COUNTIF('Apr-Raw'!P:P,\"NA\")","v":0},{"$f":"COUNTIF('Apr-Raw'!R:R,\"NA\")","v":0},{"$f":"COUNTIF('Apr-Raw'!T:T,\"NA\")","v":0},{"$f":"COUNTIF('Apr-Raw'!V:V,\"NA\")","v":0},{"$f":"COUNTIF('Apr-Raw'!X:X,\"NA\")","v":0},{"$f":"COUNTIF('Apr-Raw'!Z:Z,\"NA\")","v":0},{"$f":"COUNTIF('Apr-Raw'!AB:AB,\"NA\")","v":0},{"$f":"COUNTIF('Apr-Raw'!AD:AD,\"NA\")","v":0},{"$f":"COUNTIF('Apr-Raw'!AF:AF,\"NA\")","v":0},{"$f":"COUNTIF('Apr-Raw'!AH:AH,\"NA\")","v":0},{"$f":"COUNTIF('Apr-Raw'!AJ:AJ,\"NA\")","v":0},{"$f":"COUNTIF('Apr-Raw'!AL:AL,\"NA\")","v":0},{"$f":"COUNTIF('Apr-Raw'!AN:AN,\"NA\")","v":0},{"$f":"COUNTIF('Apr-Raw'!AP:AP,\"NA\")","v":0},{"$f":"COUNTIF('Apr-Raw'!AR:AR,\"NA\")","v":0},{"$f":"COUNTIF('Apr-Raw'!AT:AT,\"NA\")","v":0},{"$f":"COUNTIF('Apr-Raw'!AV:AV,\"NA\")","v":0},{"$f":"COUNTIF('Apr-Raw'!AX:AX,\"NA\")","v":0},{"$f":"COUNTIF('Apr-Raw'!AZ:AZ,\"NA\")","v":0},{"$f":"COUNTIF('Apr-Raw'!BB:BB,\"NA\")","v":0},{"$f":"COUNTIF('Apr-Raw'!BD:BD,\"NA\")","v":0},{"$f":"COUNTIF('Apr-Raw'!BF:BF,\"NA\")","v":0},{"$f":"COUNTIF('Apr-Raw'!BH:BH,\"NA\")","v":0},{"$f":"COUNTIF('Apr-Raw'!BJ:BJ,\"NA\")","v":0},{"$f":"COUNTIF('Apr-Raw'!BL:BL,\"NA\")","v":0},{"$f":"COUNTIF('Apr-Raw'!BN:BN,\"NA\")","v":0},{"$f":"COUNTIF('Apr-Raw'!BP:BP,\"NA\")","v":0},{"$f":"COUNTIF('Apr-Raw'!BR:BR,\"NA\")","v":0},{"$f":"COUNTIF('Apr-Raw'!BT:BT,\"NA\")","v":0},{"$f":"COUNTIF('Apr-Raw'!BV:BV,\"NA\")","v":0},{"$f":"COUNTIF('Apr-Raw'!BX:BX,\"NA\")","v":0},{"$f":"COUNTIF('Apr-Raw'!BZ:BZ,\"NA\")","v":0},{"$f":"COUNTIF('Apr-Raw'!CB:CB,\"NA\")","v":0},{"$f":"COUNTIF('Apr-Raw'!CD:CD,\"NA\")","v":0},{"$f":"COUNTIF('Apr-Raw'!CF:CF,\"NA\")","v":0},{"$f":"COUNTIF('Apr-Raw'!CH:CH,\"NA\")","v":0}]
["Blanks",{"$f":"B8-(SUM(B3:B6))","v":0},{"$f":"C8-(SUM(C3:C6))","v":0},0,0,0,0,0,0,0,0,0,0,0,0,0,0,0,0,0,0,0,0,0,0,0,0,0,0,0,0,0,0,0,0,0,0,0,0,0,0]
["full sample size",{"$f":"COUNTA('Apr-Raw'!A:A)-2","v":0},{"$f":"B8","v":0},0,0,0,0,0,0,0,0,0,0,0,0,0,0,0,0,0,0,0,0,0,0,0,0,0,0,0,0,0,0,0,0,0,0,0,0,0,0]
["True sample size (-NA + blanks)",{"$f":"IF(ISERROR(B8-(B6+B7)),\"\",B8-(B6+B7))","v":0},{"$f":"IF(ISERROR(C8-(C6+C7)),\"\",C8-(C6+C7))","v":0},0,0,0,0,0,0,0,0,0,0,0,0,0,0,0,0,0,0,0,0,0,0,0,0,0,0,0,0,0,0,0,0,0,0,0,0,0,0]
["%Y",{"$f":"IF(ISERROR(B3/B9),\"\",B3/B9)","v":""},{"$f":"IF(ISERROR(C3/C9),\"\",C3/C9)","v":""},"","","","","","","","","","","","","","","","","","","","","","","","","","","","","","","","","","","","","",""]
["%N",{"$f":"IF(ISERROR(B4/B9),\"\",B4/B9)","v":""},{"$f":"IF(ISERROR(C4/C9),\"\",C4/C9)","v":""},"","","","","","","","","","","","","","","","","","","","","","","","","","","","","","","","","","","","","",""]
["%N - Justified",{"$f":"IF(ISERROR(B5/B9),\"\",B5/B9)","v":""},{"$f":"IF(ISERROR(C5/C9),\"\",C5/C9)","v":""},"","","","","","","","","","","","","","","","","","","","","","","","","","","","","","","","","","","","","",""]

{"sheet":"May","index":9,"n_rows":51,"n_cols":8,"rows_kept":51,"cut":false,"hidden":false,"merged":[]}
["Click here to go to year overview"]
[]
["Date",null,null,"Total by Apt type"]
["Completed by",null,null,"New",{"$f":"COUNTIF('May-Raw'!E3:E103,\"New\")","v":0}]
["Sample group size",{"$f":"COUNTA('May-Raw'!A:A)-2","v":0},null,"Follow up",{"$f":"COUNTIF('May-Raw'!E3:E103,\"Fup\")","v":0},null,null,{"$f":"Year!H5","v":0.95}]
["Overall Result (compliant only)",{"$f":"IF(ISERROR(SUM(C11:C50)/G51),\"\",SUM(C11:C50)/G51)","v":""},null,"Total by apt Code",null,null,null,{"$f":"Year!H6","v":"80-95%"}]
["Overall Result (compliant & Justified)",{"$f":"IF(ISERROR(SUM(B11:B50)/G51),\"\",SUM(B11:B50)/G51)","v":""},null,"code goes in here",{"$f":"COUNTIF('May-Raw'!F3:F103,D7)","v":0},null,null,{"$f":"Year!H7","v":0.8}]
["viable qs",{"$f":"G51","v":0}]
[]
["Metric","Compliant + Justified","Compliant","Justified","Not compliant","Irritating math"]
[{"$f":"IF(ISERROR('Audit questions'!A2),\"\",'Audit questions'!A2)","v":"Test1"},{"$f":"IF(ISERROR(C11+D11),\"\",C11+D11)","v":""},{"$f":"'May-Data'!B10","v":""},{"$f":"'May-Data'!B12","v":""},{"$f":"'May-Data'!B11","v":""},{"$f":"COUNTIF(C11:E11,\">0\")","v":0}]
[{"$f":"IF(ISERROR('Audit questions'!A3),\"\",'Audit questions'!A3)","v":"Test2"},"",{"$f":"'May-Data'!C10","v":""},{"$f":"'May-Data'!C12","v":""},{"$f":"'May-Data'!C11","v":""},0]
[{"$f":"IF(ISERROR('Audit questions'!A4),\"\",'Audit questions'!A4)","v":"Test3"},"",{"$f":"'May-Data'!D10","v":""},{"$f":"'May-Data'!D12","v":""},{"$f":"'May-Data'!D11","v":""},0]
[{"$f":"IF(ISERROR('Audit questions'!A5),\"\",'Audit questions'!A5)","v":"Test4"},"",{"$f":"'May-Data'!E10","v":""},{"$f":"'May-Data'!E12","v":""},{"$f":"'May-Data'!E11","v":""},0]
[{"$f":"IF(ISERROR('Audit questions'!A6),\"\",'Audit questions'!A6)","v":"Test5"},"",{"$f":"'May-Data'!F10","v":""},{"$f":"'May-Data'!F12","v":""},{"$f":"'May-Data'!F11","v":""},0]
[{"$f":"IF(ISERROR('Audit questions'!A7),\"\",'Audit questions'!A7)","v":"Test6"},"",{"$f":"'May-Data'!G10","v":""},{"$f":"'May-Data'!G12","v":""},{"$f":"'May-Data'!G11","v":""},0]
[{"$f":"IF(ISERROR('Audit questions'!A8),\"\",'Audit questions'!A8)","v":"Test7"},"",{"$f":"'May-Data'!H10","v":""},{"$f":"'May-Data'!H12","v":""},{"$f":"'May-Data'!H11","v":""},0]
[{"$f":"IF(ISERROR('Audit questions'!A9),\"\",'Audit questions'!A9)","v":"Test8"},"",{"$f":"'May-Data'!I10","v":""},{"$f":"'May-Data'!I12","v":""},{"$f":"'May-Data'!I11","v":""},0]
[{"$f":"IF(ISERROR('Audit questions'!A10),\"\",'Audit questions'!A10)","v":"Test9"},"",{"$f":"'May-Data'!J10","v":""},{"$f":"'May-Data'!J12","v":""},{"$f":"'May-Data'!J11","v":""},0]
[{"$f":"IF(ISERROR('Audit questions'!A11),\"\",'Audit questions'!A11)","v":"Test10"},"",{"$f":"'May-Data'!K10","v":""},{"$f":"'May-Data'!K12","v":""},{"$f":"'May-Data'!K11","v":""},0]
[{"$f":"IF(ISERROR('Audit questions'!A12),\"\",'Audit questions'!A12)","v":"Test11"},"",{"$f":"'May-Data'!L10","v":""},{"$f":"'May-Data'!L12","v":""},{"$f":"'May-Data'!L11","v":""},0]
[{"$f":"IF(ISERROR('Audit questions'!A13),\"\",'Audit questions'!A13)","v":"Test12"},"",{"$f":"'May-Data'!M10","v":""},{"$f":"'May-Data'!M12","v":""},{"$f":"'May-Data'!M11","v":""},0]
[{"$f":"IF(ISERROR('Audit questions'!A14),\"\",'Audit questions'!A14)","v":"Test13"},"",{"$f":"'May-Data'!N10","v":""},{"$f":"'May-Data'!N12","v":""},{"$f":"'May-Data'!N11","v":""},0]
[{"$f":"IF(ISERROR('Audit questions'!A15),\"\",'Audit questions'!A15)","v":"Test14"},"",{"$f":"'May-Data'!O10","v":""},{"$f":"'May-Data'!O12","v":""},{"$f":"'May-Data'!O11","v":""},0]
[{"$f":"IF(ISERROR('Audit questions'!A16),\"\",'Audit questions'!A16)","v":"Test15"},"",{"$f":"'May-Data'!P10","v":""},{"$f":"'May-Data'!P12","v":""},{"$f":"'May-Data'!P11","v":""},0]
[{"$f":"IF(ISERROR('Audit questions'!A17),\"\",'Audit questions'!A17)","v":"Test16"},"",{"$f":"'May-Data'!Q10","v":""},{"$f":"'May-Data'!Q12","v":""},{"$f":"'May-Data'!Q11","v":""},0]
[{"$f":"IF(ISERROR('Audit questions'!A18),\"\",'Audit questions'!A18)","v":"Test17"},"",{"$f":"'May-Data'!R10","v":""},{"$f":"'May-Data'!R12","v":""},{"$f":"'May-Data'!R11","v":""},0]
[{"$f":"IF(ISERROR('Audit questions'!A19),\"\",'Audit questions'!A19)","v":"Test18"},"",{"$f":"'May-Data'!S10","v":""},{"$f":"'May-Data'!S12","v":""},{"$f":"'May-Data'!S11","v":""},0]
[{"$f":"IF(ISERROR('Audit questions'!A20),\"\",'Audit questions'!A20)","v":"Test19"},"",{"$f":"'May-Data'!T10","v":""},{"$f":"'May-Data'!T12","v":""},{"$f":"'May-Data'!T11","v":""},0]
[{"$f":"IF(ISERROR('Audit questions'!A21),\"\",'Audit questions'!A21)","v":"Test20"},"",{"$f":"'May-Data'!U10","v":""},{"$f":"'May-Data'!U12","v":""},{"$f":"'May-Data'!U11","v":""},0]
[{"$f":"IF(ISERROR('Audit questions'!A22),\"\",'Audit questions'!A22)","v":"Test21"},"",{"$f":"'May-Data'!V10","v":""},{"$f":"'May-Data'!V12","v":""},{"$f":"'May-Data'!V11","v":""},0]
[{"$f":"IF(ISERROR('Audit questions'!A23),\"\",'Audit questions'!A23)","v":"Test22"},"",{"$f":"'May-Data'!W10","v":""},{"$f":"'May-Data'!W12","v":""},{"$f":"'May-Data'!W11","v":""},0]
[{"$f":"IF(ISERROR('Audit questions'!A24),\"\",'Audit questions'!A24)","v":"Test23"},"",{"$f":"'May-Data'!X10","v":""},{"$f":"'May-Data'!X12","v":""},{"$f":"'May-Data'!X11","v":""},0]
[{"$f":"IF(ISERROR('Audit questions'!A25),\"\",'Audit questions'!A25)","v":"Test24"},"",{"$f":"'May-Data'!Y10","v":""},{"$f":"'May-Data'!Y12","v":""},{"$f":"'May-Data'!Y11","v":""},0]
[{"$f":"IF(ISERROR('Audit questions'!A26),\"\",'Audit questions'!A26)","v":"Test25"},"",{"$f":"'May-Data'!Z10","v":""},{"$f":"'May-Data'!Z12","v":""},{"$f":"'May-Data'!Z11","v":""},0]
[{"$f":"IF(ISERROR('Audit questions'!A27),\"\",'Audit questions'!A27)","v":"Test26"},"",{"$f":"'May-Data'!AA10","v":""},{"$f":"'May-Data'!AA12","v":""},{"$f":"'May-Data'!AA11","v":""},0]
[{"$f":"IF(ISERROR('Audit questions'!A28),\"\",'Audit questions'!A28)","v":"Test27"},"",{"$f":"'May-Data'!AB10","v":""},{"$f":"'May-Data'!AB12","v":""},{"$f":"'May-Data'!AB11","v":""},0]
[{"$f":"IF(ISERROR('Audit questions'!A29),\"\",'Audit questions'!A29)","v":"Test28"},"",{"$f":"'May-Data'!AC10","v":""},{"$f":"'May-Data'!AC12","v":""},{"$f":"'May-Data'!AC11","v":""},0]
[{"$f":"IF(ISERROR('Audit questions'!A30),\"\",'Audit questions'!A30)","v":"Test29"},"",{"$f":"'May-Data'!AD10","v":""},{"$f":"'May-Data'!AD12","v":""},{"$f":"'May-Data'!AD11","v":""},0]
[{"$f":"IF(ISERROR('Audit questions'!A31),\"\",'Audit questions'!A31)","v":"Test30"},"",{"$f":"'May-Data'!AE10","v":""},{"$f":"'May-Data'!AE12","v":""},{"$f":"'May-Data'!AE11","v":""},0]
[{"$f":"IF(ISERROR('Audit questions'!A32),\"\",'Audit questions'!A32)","v":"Test31"},"",{"$f":"'May-Data'!AF10","v":""},{"$f":"'May-Data'!AF12","v":""},{"$f":"'May-Data'!AF11","v":""},0]
[{"$f":"IF(ISERROR('Audit questions'!A33),\"\",'Audit questions'!A33)","v":"Test32"},"",{"$f":"'May-Data'!AG10","v":""},{"$f":"'May-Data'!AG12","v":""},{"$f":"'May-Data'!AG11","v":""},0]
[{"$f":"IF(ISERROR('Audit questions'!A34),\"\",'Audit questions'!A34)","v":"Test33"},"",{"$f":"'May-Data'!AH10","v":""},{"$f":"'May-Data'!AH12","v":""},{"$f":"'May-Data'!AH11","v":""},0]
[{"$f":"IF(ISERROR('Audit questions'!A35),\"\",'Audit questions'!A35)","v":"Test34"},"",{"$f":"'May-Data'!AI10","v":""},{"$f":"'May-Data'!AI12","v":""},{"$f":"'May-Data'!AI11","v":""},0]
[{"$f":"IF(ISERROR('Audit questions'!A36),\"\",'Audit questions'!A36)","v":"Test35"},"",{"$f":"'May-Data'!AJ10","v":""},{"$f":"'May-Data'!AJ12","v":""},{"$f":"'May-Data'!AJ11","v":""},0]
[{"$f":"IF(ISERROR('Audit questions'!A37),\"\",'Audit questions'!A37)","v":"Test36"},"",{"$f":"'May-Data'!AK10","v":""},{"$f":"'May-Data'!AK12","v":""},{"$f":"'May-Data'!AK11","v":""},0]
[{"$f":"IF(ISERROR('Audit questions'!A38),\"\",'Audit questions'!A38)","v":"Test37"},"",{"$f":"'May-Data'!AL10","v":""},{"$f":"'May-Data'!AL12","v":""},{"$f":"'May-Data'!AL11","v":""},0]
[{"$f":"IF(ISERROR('Audit questions'!A39),\"\",'Audit questions'!A39)","v":"Test38"},"",{"$f":"'May-Data'!AM10","v":""},{"$f":"'May-Data'!AM12","v":""},{"$f":"'May-Data'!AM11","v":""},0]
[{"$f":"IF(ISERROR('Audit questions'!A40),\"\",'Audit questions'!A40)","v":"Test39"},"",{"$f":"'May-Data'!AN10","v":""},{"$f":"'May-Data'!AN12","v":""},{"$f":"'May-Data'!AN11","v":""},0]
[{"$f":"IF(ISERROR('Audit questions'!A41),\"\",'Audit questions'!A41)","v":"Test40"},"",{"$f":"'May-Data'!AO10","v":""},{"$f":"'May-Data'!AO12","v":""},{"$f":"'May-Data'!AO11","v":""},0]
[null,null,null,null,null,null,{"$f":"COUNTIF(F11:F50,\">=1\")","v":0}]

{"sheet":"May-Raw","index":10,"n_rows":2,"n_cols":87,"rows_kept":2,"cut":false,"hidden":true,"merged":[[0,85,0,86],[0,63,0,64],[0,65,0,66],[0,67,0,68],[0,69,0,70],[0,71,0,72],[0,73,0,74],[0,75,0,76],[0,77,0,78],[0,79,0,80],[0,81,0,82],[0,83,0,84],[0,61,0,62],[0,39,0,40],[0,41,0,42],[0,43,0,44],[0,45,0,46],[0,47,0,48],[0,49,0,50],[0,51,0,52],[0,53,0,54],[0,55,0,56],[0,57,0,58],[0,59,0,60],[0,37,0,38],[0,15,0,16],[0,17,0,18],[0,19,0,20],[0,21,0,22],[0,23,0,24],[0,25,0,26],[0,27,0,28],[0,29,0,30],[0,31,0,32],[0,33,0,34],[0,35,0,36],[0,13,0,14],[0,0,0,5],[0,6,1,6],[0,7,0,8],[0,9,0,10],[0,11,0,12]]}
["Record details",null,null,null,null,null,"Notes",{"$f":"'Audit questions'!A2","v":"Test1"},null,{"$f":"'Audit questions'!A3","v":"Test2"},null,{"$f":"'Audit questions'!A4","v":"Test3"},null,{"$f":"'Audit questions'!A5","v":"Test4"},null,{"$f":"'Audit questions'!A6","v":"Test5"},null,{"$f":"'Audit questions'!A7","v":"Test6"},null,{"$f":"'Audit questions'!A8","v":"Test7"},null,{"$f":"'Audit questions'!A9","v":"Test8"},null,{"$f":"'Audit questions'!A10","v":"Test9"},null,{"$f":"'Audit questions'!A11","v":"Test10"},null,{"$f":"'Audit questions'!A12","v":"Test11"},null,{"$f":"'Audit questions'!A13","v":"Test12"},null,{"$f":"'Audit questions'!A14","v":"Test13"},null,{"$f":"'Audit questions'!A15","v":"Test14"},null,{"$f":"'Audit questions'!A16","v":"Test15"},null,{"$f":"'Audit questions'!A17","v":"Test16"},null,{"$f":"'Audit questions'!A18","v":"Test17"},null,{"$f":"'Audit questions'!A19","v":"Test18"},null,{"$f":"'Audit questions'!A20","v":"Test19"},null,{"$f":"'Audit questions'!A21","v":"Test20"},null,{"$f":"'Audit questions'!A22","v":"Test21"},null,{"$f":"'Audit questions'!A23","v":"Test22"},null,{"$f":"'Audit questions'!A24","v":"Test23"},null,{"$f":"'Audit questions'!A25","v":"Test24"},null,{"$f":"'Audit questions'!A26","v":"Test25"},null,{"$f":"'Audit questions'!A27","v":"Test26"},null,{"$f":"'Audit questions'!A28","v":"Test27"},null,{"$f":"'Audit questions'!A29","v":"Test28"},null,{"$f":"'Audit questions'!A30","v":"Test29"},null,{"$f":"'Audit questions'!A31","v":"Test30"},null,{"$f":"'Audit questions'!A32","v":"Test31"},null,{"$f":"'Audit questions'!A33","v":"Test32"},null,{"$f":"'Audit questions'!A34","v":"Test33"},null,{"$f":"'Audit questions'!A35","v":"Test34"},null,{"$f":"'Audit questions'!A36","v":"Test35"},null,{"$f":"'Audit questions'!A37","v":"Test36"},null,{"$f":"'Audit questions'!A38","v":"Test37"},null,{"$f":"'Audit questions'!A39","v":"Test38"},null,{"$f":"'Audit questions'!A40","v":"Test39"},null,{"$f":"'Audit questions'!A41","v":"Test40"}]
["Pt number","Date seen","Clinician 1","clinician 2","New/ F-up","Apt code",null,"Compliant?","Other result","Compliant?","Other result","Compliant?","Other result","Compliant?","Other result","Compliant?","Other result","Compliant?","Other result","Compliant?","Other result","Compliant?","Other result","Compliant?","Other result","Compliant?","Other result","Compliant?","Other result","Compliant?","Other result","Compliant?","Other result","Compliant?","Other result","Compliant?","Other result","Compliant?","Other result","Compliant?","Other result","Compliant?","Other result","Compliant?","Other result","Compliant?","Other result","Compliant?","Other result","Compliant?","Other result","Compliant?","Other result","Compliant?","Other result","Compliant?","Other result","Compliant?","Other result","Compliant?","Other result","Compliant?","Other result","Compliant?","Other result","Compliant?","Other result","Compliant?","Other result","Compliant?","Other result","Compliant?","Other result","Compliant?","Other result","Compliant?","Other result","Compliant?","Other result","Compliant?","Other result","Compliant?","Other result","Compliant?","Other result","Compliant?","Other result"]

{"sheet":"May-Data","index":11,"n_rows":12,"n_cols":41,"rows_kept":12,"cut":false,"hidden":true,"merged":[[0,0,1,0]]}
["Results",{"$f":"'Audit questions'!A2","v":"Test1"},{"$f":"'Audit questions'!A3","v":"Test2"},{"$f":"'Audit questions'!A4","v":"Test3"},{"$f":"'Audit questions'!A5","v":"Test4"},{"$f":"'Audit questions'!A6","v":"Test5"},{"$f":"'Audit questions'!A7","v":"Test6"},{"$f":"'Audit questions'!A8","v":"Test7"},{"$f":"'Audit questions'!A9","v":"Test8"},{"$f":"'Audit questions'!A10","v":"Test9"},{"$f":"'Audit questions'!A11","v":"Test10"},{"$f":"'Audit questions'!A12","v":"Test11"},{"$f":"'Audit questions'!A13","v":"Test12"},{"$f":"'Audit questions'!A14","v":"Test13"},{"$f":"'Audit questions'!A15","v":"Test14"},{"$f":"'Audit questions'!A16","v":"Test15"},{"$f":"'Audit questions'!A17","v":"Test16"},{"$f":"'Audit questions'!A18","v":"Test17"},{"$f":"'Audit questions'!A19","v":"Test18"},{"$f":"'Audit questions'!A20","v":"Test19"},{"$f":"'Audit questions'!A21","v":"Test20"},{"$f":"'Audit questions'!A22","v":"Test21"},{"$f":"'Audit questions'!A23","v":"Test22"},{"$f":"'Audit questions'!A24","v":"Test23"},{"$f":"'Audit questions'!A25","v":"Test24"},{"$f":"'Audit questions'!A26","v":"Test25"},{"$f":"'Audit questions'!A27","v":"Test26"},{"$f":"'Audit questions'!A28","v":"Test27"},{"$f":"'Audit questions'!A29","v":"Test28"},{"$f":"'Audit questions'!A30","v":"Test29"},{"$f":"'Audit questions'!A31","v":"Test30"},{"$f":"'Audit questions'!A32","v":"Test31"},{"$f":"'Audit questions'!A33","v":"Test32"},{"$f":"'Audit questions'!A34","v":"Test33"},{"$f":"'Audit questions'!A35","v":"Test34"},{"$f":"'Audit questions'!A36","v":"Test35"},{"$f":"'Audit questions'!A37","v":"Test36"},{"$f":"'Audit questions'!A38","v":"Test37"},{"$f":"'Audit questions'!A39","v":"Test38"},{"$f":"'Audit questions'!A40","v":"Test39"},{"$f":"'Audit questions'!A41","v":"Test40"}]
[null,"Compliant?","Compliant?","Compliant?","Compliant?","Compliant?","Compliant?","Compliant?","Compliant?","Compliant?","Compliant?","Compliant?","Compliant?","Compliant?","Compliant?","Compliant?","Compliant?","Compliant?","Compliant?","Compliant?","Compliant?","Compliant?","Compliant?","Compliant?","Compliant?","Compliant?","Compliant?","Compliant?","Compliant?","Compliant?","Compliant?","Compliant?","Compliant?","Compliant?","Compliant?","Compliant?","Compliant?","Compliant?","Compliant?","Compliant?","Compliant?"]
["Total Y",{"$f":"COUNTIF('May-Raw'!H:H,\"yes\")","v":0},{"$f":"COUNTIF('May-Raw'!J:J,\"yes\")","v":0},{"$f":"COUNTIF('May-Raw'!L:L,\"yes\")","v":0},{"$f":"COUNTIF('May-Raw'!N:N,\"yes\")","v":0},{"$f":"COUNTIF('May-Raw'!P:P,\"yes\")","v":0},{"$f":"COUNTIF('May-Raw'!R:R,\"yes\")","v":0},{"$f":"COUNTIF('May-Raw'!T:T,\"yes\")","v":0},{"$f":"COUNTIF('May-Raw'!V:V,\"yes\")","v":0},{"$f":"COUNTIF('May-Raw'!X:X,\"yes\")","v":0},{"$f":"COUNTIF('May-Raw'!Z:Z,\"yes\")","v":0},{"$f":"COUNTIF('May-Raw'!AB:AB,\"yes\")","v":0},{"$f":"COUNTIF('May-Raw'!AD:AD,\"yes\")","v":0},{"$f":"COUNTIF('May-Raw'!AF:AF,\"yes\")","v":0},{"$f":"COUNTIF('May-Raw'!AH:AH,\"yes\")","v":0},{"$f":"COUNTIF('May-Raw'!AJ:AJ,\"yes\")","v":0},{"$f":"COUNTIF('May-Raw'!AL:AL,\"yes\")","v":0},{"$f":"COUNTIF('May-Raw'!AN:AN,\"yes\")","v":0},{"$f":"COUNTIF('May-Raw'!AP:AP,\"yes\")","v":0},{"$f":"COUNTIF('May-Raw'!AR:AR,\"yes\")","v":0},{"$f":"COUNTIF('May-Raw'!AT:AT,\"yes\")","v":0},{"$f":"COUNTIF('May-Raw'!AV:AV,\"yes\")","v":0},{"$f":"COUNTIF('May-Raw'!AX:AX,\"yes\")","v":0},{"$f":"COUNTIF('May-Raw'!AZ:AZ,\"yes\")","v":0},{"$f":"COUNTIF('May-Raw'!BB:BB,\"yes\")","v":0},{"$f":"COUNTIF('May-Raw'!BD:BD,\"yes\")","v":0},{"$f":"COUNTIF('May-Raw'!BF:BF,\"yes\")","v":0},{"$f":"COUNTIF('May-Raw'!BH:BH,\"yes\")","v":0},{"$f":"COUNTIF('May-Raw'!BJ:BJ,\"yes\")","v":0},{"$f":"COUNTIF('May-Raw'!BL:BL,\"yes\")","v":0},{"$f":"COUNTIF('May-Raw'!BN:BN,\"yes\")","v":0},{"$f":"COUNTIF('May-Raw'!BP:BP,\"yes\")","v":0},{"$f":"COUNTIF('May-Raw'!BR:BR,\"yes\")","v":0},{"$f":"COUNTIF('May-Raw'!BT:BT,\"yes\")","v":0},{"$f":"COUNTIF('May-Raw'!BV:BV,\"yes\")","v":0},{"$f":"COUNTIF('May-Raw'!BX:BX,\"yes\")","v":0},{"$f":"COUNTIF('May-Raw'!BZ:BZ,\"yes\")","v":0},{"$f":"COUNTIF('May-Raw'!CB:CB,\"yes\")","v":0},{"$f":"COUNTIF('May-Raw'!CD:CD,\"yes\")","v":0},{"$f":"COUNTIF('May-Raw'!CF:CF,\"yes\")","v":0},{"$f":"COUNTIF('May-Raw'!CH:CH,\"yes\")","v":0}]
["Total N",{"$f":"COUNTIF('May-Raw'!H:H,\"no\")","v":0},{"$f":"COUNTIF('May-Raw'!J:J,\"no\")","v":0},{"$f":"COUNTIF('May-Raw'!L:L,\"no\")","v":0},{"$f":"COUNTIF('May-Raw'!N:N,\"no\")","v":0},{"$f":"COUNTIF('May-Raw'!P:P,\"no\")","v":0},{"$f":"COUNTIF('May-Raw'!R:R,\"no\")","v":0},{"$f":"COUNTIF('May-Raw'!T:T,\"no\")","v":0},{"$f":"COUNTIF('May-Raw'!V:V,\"no\")","v":0},{"$f":"COUNTIF('May-Raw'!X:X,\"no\")","v":0},{"$f":"COUNTIF('May-Raw'!Z:Z,\"no\")","v":0},{"$f":"COUNTIF('May-Raw'!AB:AB,\"no\")","v":0},{"$f":"COUNTIF('May-Raw'!AD:AD,\"no\")","v":0},{"$f":"COUNTIF('May-Raw'!AF:AF,\"no\")","v":0},{"$f":"COUNTIF('May-Raw'!AH:AH,\"no\")","v":0},{"$f":"COUNTIF('May-Raw'!AJ:AJ,\"no\")","v":0},{"$f":"COUNTIF('May-Raw'!AL:AL,\"no\")","v":0},{"$f":"COUNTIF('May-Raw'!AN:AN,\"no\")","v":0},{"$f":"COUNTIF('May-Raw'!AP:AP,\"no\")","v":0},{"$f":"COUNTIF('May-Raw'!AR:AR,\"no\")","v":0},{"$f":"COUNTIF('May-Raw'!AT:AT,\"no\")","v":0},{"$f":"COUNTIF('May-Raw'!AV:AV,\"no\")","v":0},{"$f":"COUNTIF('May-Raw'!AX:AX,\"no\")","v":0},{"$f":"COUNTIF('May-Raw'!AZ:AZ,\"no\")","v":0},{"$f":"COUNTIF('May-Raw'!BB:BB,\"no\")","v":0},{"$f":"COUNTIF('May-Raw'!BD:BD,\"no\")","v":0},{"$f":"COUNTIF('May-Raw'!BF:BF,\"no\")","v":0},{"$f":"COUNTIF('May-Raw'!BH:BH,\"no\")","v":0},{"$f":"COUNTIF('May-Raw'!BJ:BJ,\"no\")","v":0},{"$f":"COUNTIF('May-Raw'!BL:BL,\"no\")","v":0},{"$f":"COUNTIF('May-Raw'!BN:BN,\"no\")","v":0},{"$f":"COUNTIF('May-Raw'!BP:BP,\"no\")","v":0},{"$f":"COUNTIF('May-Raw'!BR:BR,\"no\")","v":0},{"$f":"COUNTIF('May-Raw'!BT:BT,\"no\")","v":0},{"$f":"COUNTIF('May-Raw'!BV:BV,\"no\")","v":0},{"$f":"COUNTIF('May-Raw'!BX:BX,\"no\")","v":0},{"$f":"COUNTIF('May-Raw'!BZ:BZ,\"no\")","v":0},{"$f":"COUNTIF('May-Raw'!CB:CB,\"no\")","v":0},{"$f":"COUNTIF('May-Raw'!CD:CD,\"no\")","v":0},{"$f":"COUNTIF('May-Raw'!CF:CF,\"no\")","v":0},{"$f":"COUNTIF('May-Raw'!CH:CH,\"no\")","v":0}]
["Total Justified",{"$f":"COUNTIF('May-Raw'!H:H,\"Justified\")","v":0},{"$f":"COUNTIF('May-Raw'!J:J,\"Justified\")","v":0},{"$f":"COUNTIF('May-Raw'!L:L,\"Justified\")","v":0},{"$f":"COUNTIF('May-Raw'!N:N,\"Justified\")","v":0},{"$f":"COUNTIF('May-Raw'!P:P,\"Justified\")","v":0},{"$f":"COUNTIF('May-Raw'!R:R,\"Justified\")","v":0},{"$f":"COUNTIF('May-Raw'!T:T,\"Justified\")","v":0},{"$f":"COUNTIF('May-Raw'!V:V,\"Justified\")","v":0},{"$f":"COUNTIF('May-Raw'!X:X,\"Justified\")","v":0},{"$f":"COUNTIF('May-Raw'!Z:Z,\"Justified\")","v":0},{"$f":"COUNTIF('May-Raw'!AB:AB,\"Justified\")","v":0},{"$f":"COUNTIF('May-Raw'!AD:AD,\"Justified\")","v":0},{"$f":"COUNTIF('May-Raw'!AF:AF,\"Justified\")","v":0},{"$f":"COUNTIF('May-Raw'!AH:AH,\"Justified\")","v":0},{"$f":"COUNTIF('May-Raw'!AJ:AJ,\"Justified\")","v":0},{"$f":"COUNTIF('May-Raw'!AL:AL,\"Justified\")","v":0},{"$f":"COUNTIF('May-Raw'!AN:AN,\"Justified\")","v":0},{"$f":"COUNTIF('May-Raw'!AP:AP,\"Justified\")","v":0},{"$f":"COUNTIF('May-Raw'!AR:AR,\"Justified\")","v":0},{"$f":"COUNTIF('May-Raw'!AT:AT,\"Justified\")","v":0},{"$f":"COUNTIF('May-Raw'!AV:AV,\"Justified\")","v":0},{"$f":"COUNTIF('May-Raw'!AX:AX,\"Justified\")","v":0},{"$f":"COUNTIF('May-Raw'!AZ:AZ,\"Justified\")","v":0},{"$f":"COUNTIF('May-Raw'!BB:BB,\"Justified\")","v":0},{"$f":"COUNTIF('May-Raw'!BD:BD,\"Justified\")","v":0},{"$f":"COUNTIF('May-Raw'!BF:BF,\"Justified\")","v":0},{"$f":"COUNTIF('May-Raw'!BH:BH,\"Justified\")","v":0},{"$f":"COUNTIF('May-Raw'!BJ:BJ,\"Justified\")","v":0},{"$f":"COUNTIF('May-Raw'!BL:BL,\"Justified\")","v":0},{"$f":"COUNTIF('May-Raw'!BN:BN,\"Justified\")","v":0},{"$f":"COUNTIF('May-Raw'!BP:BP,\"Justified\")","v":0},{"$f":"COUNTIF('May-Raw'!BR:BR,\"Justified\")","v":0},{"$f":"COUNTIF('May-Raw'!BT:BT,\"Justified\")","v":0},{"$f":"COUNTIF('May-Raw'!BV:BV,\"Justified\")","v":0},{"$f":"COUNTIF('May-Raw'!BX:BX,\"Justified\")","v":0},{"$f":"COUNTIF('May-Raw'!BZ:BZ,\"Justified\")","v":0},{"$f":"COUNTIF('May-Raw'!CB:CB,\"Justified\")","v":0},{"$f":"COUNTIF('May-Raw'!CD:CD,\"Justified\")","v":0},{"$f":"COUNTIF('May-Raw'!CF:CF,\"Justified\")","v":0},{"$f":"COUNTIF('May-Raw'!CH:CH,\"Justified\")","v":0}]
["Total NA",{"$f":"COUNTIF('May-Raw'!H:H,\"NA\")","v":0},{"$f":"COUNTIF('May-Raw'!J:J,\"NA\")","v":0},{"$f":"COUNTIF('May-Raw'!L:L,\"NA\")","v":0},{"$f":"COUNTIF('May-Raw'!N:N,\"NA\")","v":0},{"$f":"COUNTIF('May-Raw'!P:P,\"NA\")","v":0},{"$f":"COUNTIF('May-Raw'!R:R,\"NA\")","v":0},{"$f":"COUNTIF('May-Raw'!T:T,\"NA\")","v":0},{"$f":"COUNTIF('May-Raw'!V:V,\"NA\")","v":0},{"$f":"COUNTIF('May-Raw'!X:X,\"NA\")","v":0},{"$f":"COUNTIF('May-Raw'!Z:Z,\"NA\")","v":0},{"$f":"COUNTIF('May-Raw'!AB:AB,\"NA\")","v":0},{"$f":"COUNTIF('May-Raw'!AD:AD,\"NA\")","v":0},{"$f":"COUNTIF('May-Raw'!AF:AF,\"NA\")","v":0},{"$f":"COUNTIF('May-Raw'!AH:AH,\"NA\")","v":0},{"$f":"COUNTIF('May-Raw'!AJ:AJ,\"NA\")","v":0},{"$f":"COUNTIF('May-Raw'!AL:AL,\"NA\")","v":0},{"$f":"COUNTIF('May-Raw'!AN:AN,\"NA\")","v":0},{"$f":"COUNTIF('May-Raw'!AP:AP,\"NA\")","v":0},{"$f":"COUNTIF('May-Raw'!AR:AR,\"NA\")","v":0},{"$f":"COUNTIF('May-Raw'!AT:AT,\"NA\")","v":0},{"$f":"COUNTIF('May-Raw'!AV:AV,\"NA\")","v":0},{"$f":"COUNTIF('May-Raw'!AX:AX,\"NA\")","v":0},{"$f":"COUNTIF('May-Raw'!AZ:AZ,\"NA\")","v":0},{"$f":"COUNTIF('May-Raw'!BB:BB,\"NA\")","v":0},{"$f":"COUNTIF('May-Raw'!BD:BD,\"NA\")","v":0},{"$f":"COUNTIF('May-Raw'!BF:BF,\"NA\")","v":0},{"$f":"COUNTIF('May-Raw'!BH:BH,\"NA\")","v":0},{"$f":"COUNTIF('May-Raw'!BJ:BJ,\"NA\")","v":0},{"$f":"COUNTIF('May-Raw'!BL:BL,\"NA\")","v":0},{"$f":"COUNTIF('May-Raw'!BN:BN,\"NA\")","v":0},{"$f":"COUNTIF('May-Raw'!BP:BP,\"NA\")","v":0},{"$f":"COUNTIF('May-Raw'!BR:BR,\"NA\")","v":0},{"$f":"COUNTIF('May-Raw'!BT:BT,\"NA\")","v":0},{"$f":"COUNTIF('May-Raw'!BV:BV,\"NA\")","v":0},{"$f":"COUNTIF('May-Raw'!BX:BX,\"NA\")","v":0},{"$f":"COUNTIF('May-Raw'!BZ:BZ,\"NA\")","v":0},{"$f":"COUNTIF('May-Raw'!CB:CB,\"NA\")","v":0},{"$f":"COUNTIF('May-Raw'!CD:CD,\"NA\")","v":0},{"$f":"COUNTIF('May-Raw'!CF:CF,\"NA\")","v":0},{"$f":"COUNTIF('May-Raw'!CH:CH,\"NA\")","v":0}]
["Blanks",{"$f":"B8-(SUM(B3:B6))","v":0},{"$f":"C8-(SUM(C3:C6))","v":0},0,0,0,0,0,0,0,0,0,0,0,0,0,0,0,0,0,0,0,0,0,0,0,0,0,0,0,0,0,0,0,0,0,0,0,0,0,0]
["full sample size",{"$f":"COUNTA('May-Raw'!A:A)-2","v":0},{"$f":"B8","v":0},0,0,0,0,0,0,0,0,0,0,0,0,0,0,0,0,0,0,0,0,0,0,0,0,0,0,0,0,0,0,0,0,0,0,0,0,0,0]
["True sample size (-NA + blanks)",{"$f":"IF(ISERROR(B8-(B6+B7)),\"\",B8-(B6+B7))","v":0},{"$f":"IF(ISERROR(C8-(C6+C7)),\"\",C8-(C6+C7))","v":0},0,0,0,0,0,0,0,0,0,0,0,0,0,0,0,0,0,0,0,0,0,0,0,0,0,0,0,0,0,0,0,0,0,0,0,0,0,0]
["%Y",{"$f":"IF(ISERROR(B3/B9),\"\",B3/B9)","v":""},{"$f":"IF(ISERROR(C3/C9),\"\",C3/C9)","v":""},"","","","","","","","","","","","","","","","","","","","","","","","","","","","","","","","","","","","","",""]
["%N",{"$f":"IF(ISERROR(B4/B9),\"\",B4/B9)","v":""},{"$f":"IF(ISERROR(C4/C9),\"\",C4/C9)","v":""},"","","","","","","","","","","","","","","","","","","","","","","","","","","","","","","","","","","","","",""]
["%N - Justified",{"$f":"IF(ISERROR(B5/B9),\"\",B5/B9)","v":""},{"$f":"IF(ISERROR(C5/C9),\"\",C5/C9)","v":""},"","","","","","","","","","","","","","","","","","","","","","","","","","","","","","","","","","","","","",""]

{"sheet":"June","index":12,"n_rows":51,"n_cols":8,"rows_kept":51,"cut":false,"hidden":false,"merged":[]}
["Click here to go to year overview"]
[]
["Date",null,null,"Total by Apt type"]
["Completed by",null,null,"New",{"$f":"COUNTIF('June-Raw'!E3:E103,\"New\")","v":0}]
["Sample group size",{"$f":"COUNTA('June-Raw'!A:A)-2","v":0},null,"Follow up",{"$f":"COUNTIF('June-Raw'!E3:E103,\"Fup\")","v":0},null,null,{"$f":"Year!H5","v":0.95}]
["Overall Result (compliant only)",{"$f":"IF(ISERROR(SUM(C11:C50)/G51),\"\",SUM(C11:C50)/G51)","v":""},null,"Total by apt Code",null,null,null,{"$f":"Year!H6","v":"80-95%"}]
["Overall Result (compliant & Justified)",{"$f":"IF(ISERROR(SUM(B11:B50)/G51),\"\",SUM(B11:B50)/G51)","v":""},null,"code goes in here",{"$f":"COUNTIF('June-Raw'!F3:F103,D7)","v":0},null,null,{"$f":"Year!H7","v":0.8}]
["viable qs",{"$f":"G51","v":0}]
[]
["Metric","Compliant + Justified","Compliant","Justified","Not compliant","Irritating math"]
[{"$f":"IF(ISERROR('Audit questions'!A2),\"\",'Audit questions'!A2)","v":"Test1"},{"$f":"IF(ISERROR(C11+D11),\"\",C11+D11)","v":""},{"$f":"'June-Data'!B10","v":""},{"$f":"'June-Data'!B12","v":""},{"$f":"'June-Data'!B11","v":""},{"$f":"COUNTIF(C11:E11,\">0\")","v":0}]
[{"$f":"IF(ISERROR('Audit questions'!A3),\"\",'Audit questions'!A3)","v":"Test2"},"",{"$f":"'June-Data'!C10","v":""},{"$f":"'June-Data'!C12","v":""},{"$f":"'June-Data'!C11","v":""},0]
[{"$f":"IF(ISERROR('Audit questions'!A4),\"\",'Audit questions'!A4)","v":"Test3"},"",{"$f":"'June-Data'!D10","v":""},{"$f":"'June-Data'!D12","v":""},{"$f":"'June-Data'!D11","v":""},0]
[{"$f":"IF(ISERROR('Audit questions'!A5),\"\",'Audit questions'!A5)","v":"Test4"},"",{"$f":"'June-Data'!E10","v":""},{"$f":"'June-Data'!E12","v":""},{"$f":"'June-Data'!E11","v":""},0]
[{"$f":"IF(ISERROR('Audit questions'!A6),\"\",'Audit questions'!A6)","v":"Test5"},"",{"$f":"'June-Data'!F10","v":""},{"$f":"'June-Data'!F12","v":""},{"$f":"'June-Data'!F11","v":""},0]
[{"$f":"IF(ISERROR('Audit questions'!A7),\"\",'Audit questions'!A7)","v":"Test6"},"",{"$f":"'June-Data'!G10","v":""},{"$f":"'June-Data'!G12","v":""},{"$f":"'June-Data'!G11","v":""},0]
[{"$f":"IF(ISERROR('Audit questions'!A8),\"\",'Audit questions'!A8)","v":"Test7"},"",{"$f":"'June-Data'!H10","v":""},{"$f":"'June-Data'!H12","v":""},{"$f":"'June-Data'!H11","v":""},0]
[{"$f":"IF(ISERROR('Audit questions'!A9),\"\",'Audit questions'!A9)","v":"Test8"},"",{"$f":"'June-Data'!I10","v":""},{"$f":"'June-Data'!I12","v":""},{"$f":"'June-Data'!I11","v":""},0]
[{"$f":"IF(ISERROR('Audit questions'!A10),\"\",'Audit questions'!A10)","v":"Test9"},"",{"$f":"'June-Data'!J10","v":""},{"$f":"'June-Data'!J12","v":""},{"$f":"'June-Data'!J11","v":""},0]
[{"$f":"IF(ISERROR('Audit questions'!A11),\"\",'Audit questions'!A11)","v":"Test10"},"",{"$f":"'June-Data'!K10","v":""},{"$f":"'June-Data'!K12","v":""},{"$f":"'June-Data'!K11","v":""},0]
[{"$f":"IF(ISERROR('Audit questions'!A12),\"\",'Audit questions'!A12)","v":"Test11"},"",{"$f":"'June-Data'!L10","v":""},{"$f":"'June-Data'!L12","v":""},{"$f":"'June-Data'!L11","v":""},0]
[{"$f":"IF(ISERROR('Audit questions'!A13),\"\",'Audit questions'!A13)","v":"Test12"},"",{"$f":"'June-Data'!M10","v":""},{"$f":"'June-Data'!M12","v":""},{"$f":"'June-Data'!M11","v":""},0]
[{"$f":"IF(ISERROR('Audit questions'!A14),\"\",'Audit questions'!A14)","v":"Test13"},"",{"$f":"'June-Data'!N10","v":""},{"$f":"'June-Data'!N12","v":""},{"$f":"'June-Data'!N11","v":""},0]
[{"$f":"IF(ISERROR('Audit questions'!A15),\"\",'Audit questions'!A15)","v":"Test14"},"",{"$f":"'June-Data'!O10","v":""},{"$f":"'June-Data'!O12","v":""},{"$f":"'June-Data'!O11","v":""},0]
[{"$f":"IF(ISERROR('Audit questions'!A16),\"\",'Audit questions'!A16)","v":"Test15"},"",{"$f":"'June-Data'!P10","v":""},{"$f":"'June-Data'!P12","v":""},{"$f":"'June-Data'!P11","v":""},0]
[{"$f":"IF(ISERROR('Audit questions'!A17),\"\",'Audit questions'!A17)","v":"Test16"},"",{"$f":"'June-Data'!Q10","v":""},{"$f":"'June-Data'!Q12","v":""},{"$f":"'June-Data'!Q11","v":""},0]
[{"$f":"IF(ISERROR('Audit questions'!A18),\"\",'Audit questions'!A18)","v":"Test17"},"",{"$f":"'June-Data'!R10","v":""},{"$f":"'June-Data'!R12","v":""},{"$f":"'June-Data'!R11","v":""},0]
[{"$f":"IF(ISERROR('Audit questions'!A19),\"\",'Audit questions'!A19)","v":"Test18"},"",{"$f":"'June-Data'!S10","v":""},{"$f":"'June-Data'!S12","v":""},{"$f":"'June-Data'!S11","v":""},0]
[{"$f":"IF(ISERROR('Audit questions'!A20),\"\",'Audit questions'!A20)","v":"Test19"},"",{"$f":"'June-Data'!T10","v":""},{"$f":"'June-Data'!T12","v":""},{"$f":"'June-Data'!T11","v":""},0]
[{"$f":"IF(ISERROR('Audit questions'!A21),\"\",'Audit questions'!A21)","v":"Test20"},"",{"$f":"'June-Data'!U10","v":""},{"$f":"'June-Data'!U12","v":""},{"$f":"'June-Data'!U11","v":""},0]
[{"$f":"IF(ISERROR('Audit questions'!A22),\"\",'Audit questions'!A22)","v":"Test21"},"",{"$f":"'June-Data'!V10","v":""},{"$f":"'June-Data'!V12","v":""},{"$f":"'June-Data'!V11","v":""},0]
[{"$f":"IF(ISERROR('Audit questions'!A23),\"\",'Audit questions'!A23)","v":"Test22"},"",{"$f":"'June-Data'!W10","v":""},{"$f":"'June-Data'!W12","v":""},{"$f":"'June-Data'!W11","v":""},0]
[{"$f":"IF(ISERROR('Audit questions'!A24),\"\",'Audit questions'!A24)","v":"Test23"},"",{"$f":"'June-Data'!X10","v":""},{"$f":"'June-Data'!X12","v":""},{"$f":"'June-Data'!X11","v":""},0]
[{"$f":"IF(ISERROR('Audit questions'!A25),\"\",'Audit questions'!A25)","v":"Test24"},"",{"$f":"'June-Data'!Y10","v":""},{"$f":"'June-Data'!Y12","v":""},{"$f":"'June-Data'!Y11","v":""},0]
[{"$f":"IF(ISERROR('Audit questions'!A26),\"\",'Audit questions'!A26)","v":"Test25"},"",{"$f":"'June-Data'!Z10","v":""},{"$f":"'June-Data'!Z12","v":""},{"$f":"'June-Data'!Z11","v":""},0]
[{"$f":"IF(ISERROR('Audit questions'!A27),\"\",'Audit questions'!A27)","v":"Test26"},"",{"$f":"'June-Data'!AA10","v":""},{"$f":"'June-Data'!AA12","v":""},{"$f":"'June-Data'!AA11","v":""},0]
[{"$f":"IF(ISERROR('Audit questions'!A28),\"\",'Audit questions'!A28)","v":"Test27"},"",{"$f":"'June-Data'!AB10","v":""},{"$f":"'June-Data'!AB12","v":""},{"$f":"'June-Data'!AB11","v":""},0]
[{"$f":"IF(ISERROR('Audit questions'!A29),\"\",'Audit questions'!A29)","v":"Test28"},"",{"$f":"'June-Data'!AC10","v":""},{"$f":"'June-Data'!AC12","v":""},{"$f":"'June-Data'!AC11","v":""},0]
[{"$f":"IF(ISERROR('Audit questions'!A30),\"\",'Audit questions'!A30)","v":"Test29"},"",{"$f":"'June-Data'!AD10","v":""},{"$f":"'June-Data'!AD12","v":""},{"$f":"'June-Data'!AD11","v":""},0]
[{"$f":"IF(ISERROR('Audit questions'!A31),\"\",'Audit questions'!A31)","v":"Test30"},"",{"$f":"'June-Data'!AE10","v":""},{"$f":"'June-Data'!AE12","v":""},{"$f":"'June-Data'!AE11","v":""},0]
[{"$f":"IF(ISERROR('Audit questions'!A32),\"\",'Audit questions'!A32)","v":"Test31"},"",{"$f":"'June-Data'!AF10","v":""},{"$f":"'June-Data'!AF12","v":""},{"$f":"'June-Data'!AF11","v":""},0]
[{"$f":"IF(ISERROR('Audit questions'!A33),\"\",'Audit questions'!A33)","v":"Test32"},"",{"$f":"'June-Data'!AG10","v":""},{"$f":"'June-Data'!AG12","v":""},{"$f":"'June-Data'!AG11","v":""},0]
[{"$f":"IF(ISERROR('Audit questions'!A34),\"\",'Audit questions'!A34)","v":"Test33"},"",{"$f":"'June-Data'!AH10","v":""},{"$f":"'June-Data'!AH12","v":""},{"$f":"'June-Data'!AH11","v":""},0]
[{"$f":"IF(ISERROR('Audit questions'!A35),\"\",'Audit questions'!A35)","v":"Test34"},"",{"$f":"'June-Data'!AI10","v":""},{"$f":"'June-Data'!AI12","v":""},{"$f":"'June-Data'!AI11","v":""},0]
[{"$f":"IF(ISERROR('Audit questions'!A36),\"\",'Audit questions'!A36)","v":"Test35"},"",{"$f":"'June-Data'!AJ10","v":""},{"$f":"'June-Data'!AJ12","v":""},{"$f":"'June-Data'!AJ11","v":""},0]
[{"$f":"IF(ISERROR('Audit questions'!A37),\"\",'Audit questions'!A37)","v":"Test36"},"",{"$f":"'June-Data'!AK10","v":""},{"$f":"'June-Data'!AK12","v":""},{"$f":"'June-Data'!AK11","v":""},0]
[{"$f":"IF(ISERROR('Audit questions'!A38),\"\",'Audit questions'!A38)","v":"Test37"},"",{"$f":"'June-Data'!AL10","v":""},{"$f":"'June-Data'!AL12","v":""},{"$f":"'June-Data'!AL11","v":""},0]
[{"$f":"IF(ISERROR('Audit questions'!A39),\"\",'Audit questions'!A39)","v":"Test38"},"",{"$f":"'June-Data'!AM10","v":""},{"$f":"'June-Data'!AM12","v":""},{"$f":"'June-Data'!AM11","v":""},0]
[{"$f":"IF(ISERROR('Audit questions'!A40),\"\",'Audit questions'!A40)","v":"Test39"},"",{"$f":"'June-Data'!AN10","v":""},{"$f":"'June-Data'!AN12","v":""},{"$f":"'June-Data'!AN11","v":""},0]
[{"$f":"IF(ISERROR('Audit questions'!A41),\"\",'Audit questions'!A41)","v":"Test40"},"",{"$f":"'June-Data'!AO10","v":""},{"$f":"'June-Data'!AO12","v":""},{"$f":"'June-Data'!AO11","v":""},0]
[null,null,null,null,null,null,{"$f":"COUNTIF(F11:F50,\">=1\")","v":0}]

{"sheet":"June-Raw","index":13,"n_rows":2,"n_cols":87,"rows_kept":2,"cut":false,"hidden":true,"merged":[[0,85,0,86],[0,63,0,64],[0,65,0,66],[0,67,0,68],[0,69,0,70],[0,71,0,72],[0,73,0,74],[0,75,0,76],[0,77,0,78],[0,79,0,80],[0,81,0,82],[0,83,0,84],[0,61,0,62],[0,39,0,40],[0,41,0,42],[0,43,0,44],[0,45,0,46],[0,47,0,48],[0,49,0,50],[0,51,0,52],[0,53,0,54],[0,55,0,56],[0,57,0,58],[0,59,0,60],[0,37,0,38],[0,15,0,16],[0,17,0,18],[0,19,0,20],[0,21,0,22],[0,23,0,24],[0,25,0,26],[0,27,0,28],[0,29,0,30],[0,31,0,32],[0,33,0,34],[0,35,0,36],[0,13,0,14],[0,0,0,5],[0,6,1,6],[0,7,0,8],[0,9,0,10],[0,11,0,12]]}
["Record details",null,null,null,null,null,"Notes",{"$f":"'Audit questions'!A2","v":"Test1"},null,{"$f":"'Audit questions'!A3","v":"Test2"},null,{"$f":"'Audit questions'!A4","v":"Test3"},null,{"$f":"'Audit questions'!A5","v":"Test4"},null,{"$f":"'Audit questions'!A6","v":"Test5"},null,{"$f":"'Audit questions'!A7","v":"Test6"},null,{"$f":"'Audit questions'!A8","v":"Test7"},null,{"$f":"'Audit questions'!A9","v":"Test8"},null,{"$f":"'Audit questions'!A10","v":"Test9"},null,{"$f":"'Audit questions'!A11","v":"Test10"},null,{"$f":"'Audit questions'!A12","v":"Test11"},null,{"$f":"'Audit questions'!A13","v":"Test12"},null,{"$f":"'Audit questions'!A14","v":"Test13"},null,{"$f":"'Audit questions'!A15","v":"Test14"},null,{"$f":"'Audit questions'!A16","v":"Test15"},null,{"$f":"'Audit questions'!A17","v":"Test16"},null,{"$f":"'Audit questions'!A18","v":"Test17"},null,{"$f":"'Audit questions'!A19","v":"Test18"},null,{"$f":"'Audit questions'!A20","v":"Test19"},null,{"$f":"'Audit questions'!A21","v":"Test20"},null,{"$f":"'Audit questions'!A22","v":"Test21"},null,{"$f":"'Audit questions'!A23","v":"Test22"},null,{"$f":"'Audit questions'!A24","v":"Test23"},null,{"$f":"'Audit questions'!A25","v":"Test24"},null,{"$f":"'Audit questions'!A26","v":"Test25"},null,{"$f":"'Audit questions'!A27","v":"Test26"},null,{"$f":"'Audit questions'!A28","v":"Test27"},null,{"$f":"'Audit questions'!A29","v":"Test28"},null,{"$f":"'Audit questions'!A30","v":"Test29"},null,{"$f":"'Audit questions'!A31","v":"Test30"},null,{"$f":"'Audit questions'!A32","v":"Test31"},null,{"$f":"'Audit questions'!A33","v":"Test32"},null,{"$f":"'Audit questions'!A34","v":"Test33"},null,{"$f":"'Audit questions'!A35","v":"Test34"},null,{"$f":"'Audit questions'!A36","v":"Test35"},null,{"$f":"'Audit questions'!A37","v":"Test36"},null,{"$f":"'Audit questions'!A38","v":"Test37"},null,{"$f":"'Audit questions'!A39","v":"Test38"},null,{"$f":"'Audit questions'!A40","v":"Test39"},null,{"$f":"'Audit questions'!A41","v":"Test40"}]
["Pt number","Date seen","Clinician 1","clinician 2","New/ F-up","Apt code",null,"Compliant?","Other result","Compliant?","Other result","Compliant?","Other result","Compliant?","Other result","Compliant?","Other result","Compliant?","Other result","Compliant?","Other result","Compliant?","Other result","Compliant?","Other result","Compliant?","Other result","Compliant?","Other result","Compliant?","Other result","Compliant?","Other result","Compliant?","Other result","Compliant?","Other result","Compliant?","Other result","Compliant?","Other result","Compliant?","Other result","Compliant?","Other result","Compliant?","Other result","Compliant?","Other result","Compliant?","Other result","Compliant?","Other result","Compliant?","Other result","Compliant?","Other result","Compliant?","Other result","Compliant?","Other result","Compliant?","Other result","Compliant?","Other result","Compliant?","Other result","Compliant?","Other result","Compliant?","Other result","Compliant?","Other result","Compliant?","Other result","Compliant?","Other result","Compliant?","Other result","Compliant?","Other result","Compliant?","Other result","Compliant?","Other result","Compliant?","Other result"]

{"sheet":"June-Data","index":14,"n_rows":12,"n_cols":41,"rows_kept":12,"cut":false,"hidden":true,"merged":[[0,0,1,0]]}
["Results",{"$f":"'Audit questions'!A2","v":"Test1"},{"$f":"'Audit questions'!A3","v":"Test2"},{"$f":"'Audit questions'!A4","v":"Test3"},{"$f":"'Audit questions'!A5","v":"Test4"},{"$f":"'Audit questions'!A6","v":"Test5"},{"$f":"'Audit questions'!A7","v":"Test6"},{"$f":"'Audit questions'!A8","v":"Test7"},{"$f":"'Audit questions'!A9","v":"Test8"},{"$f":"'Audit questions'!A10","v":"Test9"},{"$f":"'Audit questions'!A11","v":"Test10"},{"$f":"'Audit questions'!A12","v":"Test11"},{"$f":"'Audit questions'!A13","v":"Test12"},{"$f":"'Audit questions'!A14","v":"Test13"},{"$f":"'Audit questions'!A15","v":"Test14"},{"$f":"'Audit questions'!A16","v":"Test15"},{"$f":"'Audit questions'!A17","v":"Test16"},{"$f":"'Audit questions'!A18","v":"Test17"},{"$f":"'Audit questions'!A19","v":"Test18"},{"$f":"'Audit questions'!A20","v":"Test19"},{"$f":"'Audit questions'!A21","v":"Test20"},{"$f":"'Audit questions'!A22","v":"Test21"},{"$f":"'Audit questions'!A23","v":"Test22"},{"$f":"'Audit questions'!A24","v":"Test23"},{"$f":"'Audit questions'!A25","v":"Test24"},{"$f":"'Audit questions'!A26","v":"Test25"},{"$f":"'Audit questions'!A27","v":"Test26"},{"$f":"'Audit questions'!A28","v":"Test27"},{"$f":"'Audit questions'!A29","v":"Test28"},{"$f":"'Audit questions'!A30","v":"Test29"},{"$f":"'Audit questions'!A31","v":"Test30"},{"$f":"'Audit questions'!A32","v":"Test31"},{"$f":"'Audit questions'!A33","v":"Test32"},{"$f":"'Audit questions'!A34","v":"Test33"},{"$f":"'Audit questions'!A35","v":"Test34"},{"$f":"'Audit questions'!A36","v":"Test35"},{"$f":"'Audit questions'!A37","v":"Test36"},{"$f":"'Audit questions'!A38","v":"Test37"},{"$f":"'Audit questions'!A39","v":"Test38"},{"$f":"'Audit questions'!A40","v":"Test39"},{"$f":"'Audit questions'!A41","v":"Test40"}]
[null,"Compliant?","Compliant?","Compliant?","Compliant?","Compliant?","Compliant?","Compliant?","Compliant?","Compliant?","Compliant?","Compliant?","Compliant?","Compliant?","Compliant?","Compliant?","Compliant?","Compliant?","Compliant?","Compliant?","Compliant?","Compliant?","Compliant?","Compliant?","Compliant?","Compliant?","Compliant?","Compliant?","Compliant?","Compliant?","Compliant?","Compliant?","Compliant?","Compliant?","Compliant?","Compliant?","Compliant?","Compliant?","Compliant?","Compliant?","Compliant?"]
["Total Y",{"$f":"COUNTIF('June-Raw'!H:H,\"yes\")","v":0},{"$f":"COUNTIF('June-Raw'!J:J,\"yes\")","v":0},{"$f":"COUNTIF('June-Raw'!L:L,\"yes\")","v":0},{"$f":"COUNTIF('June-Raw'!N:N,\"yes\")","v":0},{"$f":"COUNTIF('June-Raw'!P:P,\"yes\")","v":0},{"$f":"COUNTIF('June-Raw'!R:R,\"yes\")","v":0},{"$f":"COUNTIF('June-Raw'!T:T,\"yes\")","v":0},{"$f":"COUNTIF('June-Raw'!V:V,\"yes\")","v":0},{"$f":"COUNTIF('June-Raw'!X:X,\"yes\")","v":0},{"$f":"COUNTIF('June-Raw'!Z:Z,\"yes\")","v":0},{"$f":"COUNTIF('June-Raw'!AB:AB,\"yes\")","v":0},{"$f":"COUNTIF('June-Raw'!AD:AD,\"yes\")","v":0},{"$f":"COUNTIF('June-Raw'!AF:AF,\"yes\")","v":0},{"$f":"COUNTIF('June-Raw'!AH:AH,\"yes\")","v":0},{"$f":"COUNTIF('June-Raw'!AJ:AJ,\"yes\")","v":0},{"$f":"COUNTIF('June-Raw'!AL:AL,\"yes\")","v":0},{"$f":"COUNTIF('June-Raw'!AN:AN,\"yes\")","v":0},{"$f":"COUNTIF('June-Raw'!AP:AP,\"yes\")","v":0},{"$f":"COUNTIF('June-Raw'!AR:AR,\"yes\")","v":0},{"$f":"COUNTIF('June-Raw'!AT:AT,\"yes\")","v":0},{"$f":"COUNTIF('June-Raw'!AV:AV,\"yes\")","v":0},{"$f":"COUNTIF('June-Raw'!AX:AX,\"yes\")","v":0},{"$f":"COUNTIF('June-Raw'!AZ:AZ,\"yes\")","v":0},{"$f":"COUNTIF('June-Raw'!BB:BB,\"yes\")","v":0},{"$f":"COUNTIF('June-Raw'!BD:BD,\"yes\")","v":0},{"$f":"COUNTIF('June-Raw'!BF:BF,\"yes\")","v":0},{"$f":"COUNTIF('June-Raw'!BH:BH,\"yes\")","v":0},{"$f":"COUNTIF('June-Raw'!BJ:BJ,\"yes\")","v":0},{"$f":"COUNTIF('June-Raw'!BL:BL,\"yes\")","v":0},{"$f":"COUNTIF('June-Raw'!BN:BN,\"yes\")","v":0},{"$f":"COUNTIF('June-Raw'!BP:BP,\"yes\")","v":0},{"$f":"COUNTIF('June-Raw'!BR:BR,\"yes\")","v":0},{"$f":"COUNTIF('June-Raw'!BT:BT,\"yes\")","v":0},{"$f":"COUNTIF('June-Raw'!BV:BV,\"yes\")","v":0},{"$f":"COUNTIF('June-Raw'!BX:BX,\"yes\")","v":0},{"$f":"COUNTIF('June-Raw'!BZ:BZ,\"yes\")","v":0},{"$f":"COUNTIF('June-Raw'!CB:CB,\"yes\")","v":0},{"$f":"COUNTIF('June-Raw'!CD:CD,\"yes\")","v":0},{"$f":"COUNTIF('June-Raw'!CF:CF,\"yes\")","v":0},{"$f":"COUNTIF('June-Raw'!CH:CH,\"yes\")","v":0}]
["Total N",{"$f":"COUNTIF('June-Raw'!H:H,\"no\")","v":0},{"$f":"COUNTIF('June-Raw'!J:J,\"no\")","v":0},{"$f":"COUNTIF('June-Raw'!L:L,\"no\")","v":0},{"$f":"COUNTIF('June-Raw'!N:N,\"no\")","v":0},{"$f":"COUNTIF('June-Raw'!P:P,\"no\")","v":0},{"$f":"COUNTIF('June-Raw'!R:R,\"no\")","v":0},{"$f":"COUNTIF('June-Raw'!T:T,\"no\")","v":0},{"$f":"COUNTIF('June-Raw'!V:V,\"no\")","v":0},{"$f":"COUNTIF('June-Raw'!X:X,\"no\")","v":0},{"$f":"COUNTIF('June-Raw'!Z:Z,\"no\")","v":0},{"$f":"COUNTIF('June-Raw'!AB:AB,\"no\")","v":0},{"$f":"COUNTIF('June-Raw'!AD:AD,\"no\")","v":0},{"$f":"COUNTIF('June-Raw'!AF:AF,\"no\")","v":0},{"$f":"COUNTIF('June-Raw'!AH:AH,\"no\")","v":0},{"$f":"COUNTIF('June-Raw'!AJ:AJ,\"no\")","v":0},{"$f":"COUNTIF('June-Raw'!AL:AL,\"no\")","v":0},{"$f":"COUNTIF('June-Raw'!AN:AN,\"no\")","v":0},{"$f":"COUNTIF('June-Raw'!AP:AP,\"no\")","v":0},{"$f":"COUNTIF('June-Raw'!AR:AR,\"no\")","v":0},{"$f":"COUNTIF('June-Raw'!AT:AT,\"no\")","v":0},{"$f":"COUNTIF('June-Raw'!AV:AV,\"no\")","v":0},{"$f":"COUNTIF('June-Raw'!AX:AX,\"no\")","v":0},{"$f":"COUNTIF('June-Raw'!AZ:AZ,\"no\")","v":0},{"$f":"COUNTIF('June-Raw'!BB:BB,\"no\")","v":0},{"$f":"COUNTIF('June-Raw'!BD:BD,\"no\")","v":0},{"$f":"COUNTIF('June-Raw'!BF:BF,\"no\")","v":0},{"$f":"COUNTIF('June-Raw'!BH:BH,\"no\")","v":0},{"$f":"COUNTIF('June-Raw'!BJ:BJ,\"no\")","v":0},{"$f":"COUNTIF('June-Raw'!BL:BL,\"no\")","v":0},{"$f":"COUNTIF('June-Raw'!BN:BN,\"no\")","v":0},{"$f":"COUNTIF('June-Raw'!BP:BP,\"no\")","v":0},{"$f":"COUNTIF('June-Raw'!BR:BR,\"no\")","v":0},{"$f":"COUNTIF('June-Raw'!BT:BT,\"no\")","v":0},{"$f":"COUNTIF('June-Raw'!BV:BV,\"no\")","v":0},{"$f":"COUNTIF('June-Raw'!BX:BX,\"no\")","v":0},{"$f":"COUNTIF('June-Raw'!BZ:BZ,\"no\")","v":0},{"$f":"COUNTIF('June-Raw'!CB:CB,\"no\")","v":0},{"$f":"COUNTIF('June-Raw'!CD:CD,\"no\")","v":0},{"$f":"COUNTIF('June-Raw'!CF:CF,\"no\")","v":0},{"$f":"COUNTIF('June-Raw'!CH:CH,\"no\")","v":0}]
["Total Justified",{"$f":"COUNTIF('June-Raw'!H:H,\"Justified\")","v":0},{"$f":"COUNTIF('June-Raw'!J:J,\"Justified\")","v":0},{"$f":"COUNTIF('June-Raw'!L:L,\"Justified\")","v":0},{"$f":"COUNTIF('June-Raw'!N:N,\"Justified\")","v":0},{"$f":"COUNTIF('June-Raw'!P:P,\"Justified\")","v":0},{"$f":"COUNTIF('June-Raw'!R:R,\"Justified\")","v":0},{"$f":"COUNTIF('June-Raw'!T:T,\"Justified\")","v":0},{"$f":"COUNTIF('June-Raw'!V:V,\"Justified\")","v":0},{"$f":"COUNTIF('June-Raw'!X:X,\"Justified\")","v":0},{"$f":"COUNTIF('June-Raw'!Z:Z,\"Justified\")","v":0},{"$f":"COUNTIF('June-Raw'!AB:AB,\"Justified\")","v":0},{"$f":"COUNTIF('June-Raw'!AD:AD,\"Justified\")","v":0},{"$f":"COUNTIF('June-Raw'!AF:AF,\"Justified\")","v":0},{"$f":"COUNTIF('June-Raw'!AH:AH,\"Justified\")","v":0},{"$f":"COUNTIF('June-Raw'!AJ:AJ,\"Justified\")","v":0},{"$f":"COUNTIF('June-Raw'!AL:AL,\"Justified\")","v":0},{"$f":"COUNTIF('June-Raw'!AN:AN,\"Justified\")","v":0},{"$f":"COUNTIF('June-Raw'!AP:AP,\"Justified\")","v":0},{"$f":"COUNTIF('June-Raw'!AR:AR,\"Justified\")","v":0},{"$f":"COUNTIF('June-Raw'!AT:AT,\"Justified\")","v":0},{"$f":"COUNTIF('June-Raw'!AV:AV,\"Justified\")","v":0},{"$f":"COUNTIF('June-Raw'!AX:AX,\"Justified\")","v":0},{"$f":"COUNTIF('June-Raw'!AZ:AZ,\"Justified\")","v":0},{"$f":"COUNTIF('June-Raw'!BB:BB,\"Justified\")","v":0},{"$f":"COUNTIF('June-Raw'!BD:BD,\"Justified\")","v":0},{"$f":"COUNTIF('June-Raw'!BF:BF,\"Justified\")","v":0},{"$f":"COUNTIF('June-Raw'!BH:BH,\"Justified\")","v":0},{"$f":"COUNTIF('June-Raw'!BJ:BJ,\"Justified\")","v":0},{"$f":"COUNTIF('June-Raw'!BL:BL,\"Justified\")","v":0},{"$f":"COUNTIF('June-Raw'!BN:BN,\"Justified\")","v":0},{"$f":"COUNTIF('June-Raw'!BP:BP,\"Justified\")","v":0},{"$f":"COUNTIF('June-Raw'!BR:BR,\"Justified\")","v":0},{"$f":"COUNTIF('June-Raw'!BT:BT,\"Justified\")","v":0},{"$f":"COUNTIF('June-Raw'!BV:BV,\"Justified\")","v":0},{"$f":"COUNTIF('June-Raw'!BX:BX,\"Justified\")","v":0},{"$f":"COUNTIF('June-Raw'!BZ:BZ,\"Justified\")","v":0},{"$f":"COUNTIF('June-Raw'!CB:CB,\"Justified\")","v":0},{"$f":"COUNTIF('June-Raw'!CD:CD,\"Justified\")","v":0},{"$f":"COUNTIF('June-Raw'!CF:CF,\"Justified\")","v":0},{"$f":"COUNTIF('June-Raw'!CH:CH,\"Justified\")","v":0}]
["Total NA",{"$f":"COUNTIF('June-Raw'!H:H,\"NA\")","v":0},{"$f":"COUNTIF('June-Raw'!J:J,\"NA\")","v":0},{"$f":"COUNTIF('June-Raw'!L:L,\"NA\")","v":0},{"$f":"COUNTIF('June-Raw'!N:N,\"NA\")","v":0},{"$f":"COUNTIF('June-Raw'!P:P,\"NA\")","v":0},{"$f":"COUNTIF('June-Raw'!R:R,\"NA\")","v":0},{"$f":"COUNTIF('June-Raw'!T:T,\"NA\")","v":0},{"$f":"COUNTIF('June-Raw'!V:V,\"NA\")","v":0},{"$f":"COUNTIF('June-Raw'!X:X,\"NA\")","v":0},{"$f":"COUNTIF('June-Raw'!Z:Z,\"NA\")","v":0},{"$f":"COUNTIF('June-Raw'!AB:AB,\"NA\")","v":0},{"$f":"COUNTIF('June-Raw'!AD:AD,\"NA\")","v":0},{"$f":"COUNTIF('June-Raw'!AF:AF,\"NA\")","v":0},{"$f":"COUNTIF('June-Raw'!AH:AH,\"NA\")","v":0},{"$f":"COUNTIF('June-Raw'!AJ:AJ,\"NA\")","v":0},{"$f":"COUNTIF('June-Raw'!AL:AL,\"NA\")","v":0},{"$f":"COUNTIF('June-Raw'!AN:AN,\"NA\")","v":0},{"$f":"COUNTIF('June-Raw'!AP:AP,\"NA\")","v":0},{"$f":"COUNTIF('June-Raw'!AR:AR,\"NA\")","v":0},{"$f":"COUNTIF('June-Raw'!AT:AT,\"NA\")","v":0},{"$f":"COUNTIF('June-Raw'!AV:AV,\"NA\")","v":0},{"$f":"COUNTIF('June-Raw'!AX:AX,\"NA\")","v":0},{"$f":"COUNTIF('June-Raw'!AZ:AZ,\"NA\")","v":0},{"$f":"COUNTIF('June-Raw'!BB:BB,\"NA\")","v":0},{"$f":"COUNTIF('June-Raw'!BD:BD,\"NA\")","v":0},{"$f":"COUNTIF('June-Raw'!BF:BF,\"NA\")","v":0},{"$f":"COUNTIF('June-Raw'!BH:BH,\"NA\")","v":0},{"$f":"COUNTIF('June-Raw'!BJ:BJ,\"NA\")","v":0},{"$f":"COUNTIF('June-Raw'!BL:BL,\"NA\")","v":0},{"$f":"COUNTIF('June-Raw'!BN:BN,\"NA\")","v":0},{"$f":"COUNTIF('June-Raw'!BP:BP,\"NA\")","v":0},{"$f":"COUNTIF('June-Raw'!BR:BR,\"NA\")","v":0},{"$f":"COUNTIF('June-Raw'!BT:BT,\"NA\")","v":0},{"$f":"COUNTIF('June-Raw'!BV:BV,\"NA\")","v":0},{"$f":"COUNTIF('June-Raw'!BX:BX,\"NA\")","v":0},{"$f":"COUNTIF('June-Raw'!BZ:BZ,\"NA\")","v":0},{"$f":"COUNTIF('June-Raw'!CB:CB,\"NA\")","v":0},{"$f":"COUNTIF('June-Raw'!CD:CD,\"NA\")","v":0},{"$f":"COUNTIF('June-Raw'!CF:CF,\"NA\")","v":0},{"$f":"COUNTIF('June-Raw'!CH:CH,\"NA\")","v":0}]
["Blanks",{"$f":"B8-(SUM(B3:B6))","v":0},{"$f":"C8-(SUM(C3:C6))","v":0},0,0,0,0,0,0,0,0,0,0,0,0,0,0,0,0,0,0,0,0,0,0,0,0,0,0,0,0,0,0,0,0,0,0,0,0,0,0]
["full sample size",{"$f":"COUNTA('June-Raw'!A:A)-2","v":0},{"$f":"B8","v":0},0,0,0,0,0,0,0,0,0,0,0,0,0,0,0,0,0,0,0,0,0,0,0,0,0,0,0,0,0,0,0,0,0,0,0,0,0,0]
["True sample size (-NA + blanks)",{"$f":"IF(ISERROR(B8-(B6+B7)),\"\",B8-(B6+B7))","v":0},{"$f":"IF(ISERROR(C8-(C6+C7)),\"\",C8-(C6+C7))","v":0},0,0,0,0,0,0,0,0,0,0,0,0,0,0,0,0,0,0,0,0,0,0,0,0,0,0,0,0,0,0,0,0,0,0,0,0,0,0]
["%Y",{"$f":"IF(ISERROR(B3/B9),\"\",B3/B9)","v":""},{"$f":"IF(ISERROR(C3/C9),\"\",C3/C9)","v":""},"","","","","","","","","","","","","","","","","","","","","","","","","","","","","","","","","","","","","",""]
["%N",{"$f":"IF(ISERROR(B4/B9),\"\",B4/B9)","v":""},{"$f":"IF(ISERROR(C4/C9),\"\",C4/C9)","v":""},"","","","","","","","","","","","","","","","","","","","","","","","","","","","","","","","","","","","","",""]
["%N - Justified",{"$f":"IF(ISERROR(B5/B9),\"\",B5/B9)","v":""},{"$f":"IF(ISERROR(C5/C9),\"\",C5/C9)","v":""},"","","","","","","","","","","","","","","","","","","","","","","","","","","","","","","","","","","","","",""]

{"sheet":"July","index":15,"n_rows":51,"n_cols":8,"rows_kept":51,"cut":false,"hidden":false,"merged":[]}
["Click here to go to year overview"]
[]
["Date",null,null,"Total by Apt type"]
["Completed by",null,null,"New",{"$f":"COUNTIF('July-Raw'!E3:E103,\"New\")","v":0}]
["Sample group size",{"$f":"COUNTA('July-Raw'!A:A)-2","v":0},null,"Follow up",{"$f":"COUNTIF('July-Raw'!E3:E103,\"Fup\")","v":0},null,null,{"$f":"Year!H5","v":0.95}]
["Overall Result (compliant only)",{"$f":"IF(ISERROR(SUM(C11:C50)/G51),\"\",SUM(C11:C50)/G51)","v":""},null,"Total by apt Code",null,null,null,{"$f":"Year!H6","v":"80-95%"}]
["Overall Result (compliant & Justified)",{"$f":"IF(ISERROR(SUM(B11:B50)/G51),\"\",SUM(B11:B50)/G51)","v":""},null,"code goes in here",{"$f":"COUNTIF('July-Raw'!F3:F103,D7)","v":0},null,null,{"$f":"Year!H7","v":0.8}]
["viable qs",{"$f":"G51","v":0}]
[]
["Metric","Compliant + Justified","Compliant","Justified","Not compliant","Irritating math"]
[{"$f":"IF(ISERROR('Audit questions'!A2),\"\",'Audit questions'!A2)","v":"Test1"},{"$f":"IF(ISERROR(C11+D11),\"\",C11+D11)","v":""},{"$f":"'July-Data'!B10","v":""},{"$f":"'July-Data'!B12","v":""},{"$f":"'July-Data'!B11","v":""},{"$f":"COUNTIF(C11:E11,\">0\")","v":0}]
[{"$f":"IF(ISERROR('Audit questions'!A3),\"\",'Audit questions'!A3)","v":"Test2"},"",{"$f":"'July-Data'!C10","v":""},{"$f":"'July-Data'!C12","v":""},{"$f":"'July-Data'!C11","v":""},0]
[{"$f":"IF(ISERROR('Audit questions'!A4),\"\",'Audit questions'!A4)","v":"Test3"},"",{"$f":"'July-Data'!D10","v":""},{"$f":"'July-Data'!D12","v":""},{"$f":"'July-Data'!D11","v":""},0]
[{"$f":"IF(ISERROR('Audit questions'!A5),\"\",'Audit questions'!A5)","v":"Test4"},"",{"$f":"'July-Data'!E10","v":""},{"$f":"'July-Data'!E12","v":""},{"$f":"'July-Data'!E11","v":""},0]
[{"$f":"IF(ISERROR('Audit questions'!A6),\"\",'Audit questions'!A6)","v":"Test5"},"",{"$f":"'July-Data'!F10","v":""},{"$f":"'July-Data'!F12","v":""},{"$f":"'July-Data'!F11","v":""},0]
[{"$f":"IF(ISERROR('Audit questions'!A7),\"\",'Audit questions'!A7)","v":"Test6"},"",{"$f":"'July-Data'!G10","v":""},{"$f":"'July-Data'!G12","v":""},{"$f":"'July-Data'!G11","v":""},0]
[{"$f":"IF(ISERROR('Audit questions'!A8),\"\",'Audit questions'!A8)","v":"Test7"},"",{"$f":"'July-Data'!H10","v":""},{"$f":"'July-Data'!H12","v":""},{"$f":"'July-Data'!H11","v":""},0]
[{"$f":"IF(ISERROR('Audit questions'!A9),\"\",'Audit questions'!A9)","v":"Test8"},"",{"$f":"'July-Data'!I10","v":""},{"$f":"'July-Data'!I12","v":""},{"$f":"'July-Data'!I11","v":""},0]
[{"$f":"IF(ISERROR('Audit questions'!A10),\"\",'Audit questions'!A10)","v":"Test9"},"",{"$f":"'July-Data'!J10","v":""},{"$f":"'July-Data'!J12","v":""},{"$f":"'July-Data'!J11","v":""},0]
[{"$f":"IF(ISERROR('Audit questions'!A11),\"\",'Audit questions'!A11)","v":"Test10"},"",{"$f":"'July-Data'!K10","v":""},{"$f":"'July-Data'!K12","v":""},{"$f":"'July-Data'!K11","v":""},0]
[{"$f":"IF(ISERROR('Audit questions'!A12),\"\",'Audit questions'!A12)","v":"Test11"},"",{"$f":"'July-Data'!L10","v":""},{"$f":"'July-Data'!L12","v":""},{"$f":"'July-Data'!L11","v":""},0]
[{"$f":"IF(ISERROR('Audit questions'!A13),\"\",'Audit questions'!A13)","v":"Test12"},"",{"$f":"'July-Data'!M10","v":""},{"$f":"'July-Data'!M12","v":""},{"$f":"'July-Data'!M11","v":""},0]
[{"$f":"IF(ISERROR('Audit questions'!A14),\"\",'Audit questions'!A14)","v":"Test13"},"",{"$f":"'July-Data'!N10","v":""},{"$f":"'July-Data'!N12","v":""},{"$f":"'July-Data'!N11","v":""},0]
[{"$f":"IF(ISERROR('Audit questions'!A15),\"\",'Audit questions'!A15)","v":"Test14"},"",{"$f":"'July-Data'!O10","v":""},{"$f":"'July-Data'!O12","v":""},{"$f":"'July-Data'!O11","v":""},0]
[{"$f":"IF(ISERROR('Audit questions'!A16),\"\",'Audit questions'!A16)","v":"Test15"},"",{"$f":"'July-Data'!P10","v":""},{"$f":"'July-Data'!P12","v":""},{"$f":"'July-Data'!P11","v":""},0]
[{"$f":"IF(ISERROR('Audit questions'!A17),\"\",'Audit questions'!A17)","v":"Test16"},"",{"$f":"'July-Data'!Q10","v":""},{"$f":"'July-Data'!Q12","v":""},{"$f":"'July-Data'!Q11","v":""},0]
[{"$f":"IF(ISERROR('Audit questions'!A18),\"\",'Audit questions'!A18)","v":"Test17"},"",{"$f":"'July-Data'!R10","v":""},{"$f":"'July-Data'!R12","v":""},{"$f":"'July-Data'!R11","v":""},0]
[{"$f":"IF(ISERROR('Audit questions'!A19),\"\",'Audit questions'!A19)","v":"Test18"},"",{"$f":"'July-Data'!S10","v":""},{"$f":"'July-Data'!S12","v":""},{"$f":"'July-Data'!S11","v":""},0]
[{"$f":"IF(ISERROR('Audit questions'!A20),\"\",'Audit questions'!A20)","v":"Test19"},"",{"$f":"'July-Data'!T10","v":""},{"$f":"'July-Data'!T12","v":""},{"$f":"'July-Data'!T11","v":""},0]
[{"$f":"IF(ISERROR('Audit questions'!A21),\"\",'Audit questions'!A21)","v":"Test20"},"",{"$f":"'July-Data'!U10","v":""},{"$f":"'July-Data'!U12","v":""},{"$f":"'July-Data'!U11","v":""},0]
[{"$f":"IF(ISERROR('Audit questions'!A22),\"\",'Audit questions'!A22)","v":"Test21"},"",{"$f":"'July-Data'!V10","v":""},{"$f":"'July-Data'!V12","v":""},{"$f":"'July-Data'!V11","v":""},0]
[{"$f":"IF(ISERROR('Audit questions'!A23),\"\",'Audit questions'!A23)","v":"Test22"},"",{"$f":"'July-Data'!W10","v":""},{"$f":"'July-Data'!W12","v":""},{"$f":"'July-Data'!W11","v":""},0]
[{"$f":"IF(ISERROR('Audit questions'!A24),\"\",'Audit questions'!A24)","v":"Test23"},"",{"$f":"'July-Data'!X10","v":""},{"$f":"'July-Data'!X12","v":""},{"$f":"'July-Data'!X11","v":""},0]
[{"$f":"IF(ISERROR('Audit questions'!A25),\"\",'Audit questions'!A25)","v":"Test24"},"",{"$f":"'July-Data'!Y10","v":""},{"$f":"'July-Data'!Y12","v":""},{"$f":"'July-Data'!Y11","v":""},0]
[{"$f":"IF(ISERROR('Audit questions'!A26),\"\",'Audit questions'!A26)","v":"Test25"},"",{"$f":"'July-Data'!Z10","v":""},{"$f":"'July-Data'!Z12","v":""},{"$f":"'July-Data'!Z11","v":""},0]
[{"$f":"IF(ISERROR('Audit questions'!A27),\"\",'Audit questions'!A27)","v":"Test26"},"",{"$f":"'July-Data'!AA10","v":""},{"$f":"'July-Data'!AA12","v":""},{"$f":"'July-Data'!AA11","v":""},0]
[{"$f":"IF(ISERROR('Audit questions'!A28),\"\",'Audit questions'!A28)","v":"Test27"},"",{"$f":"'July-Data'!AB10","v":""},{"$f":"'July-Data'!AB12","v":""},{"$f":"'July-Data'!AB11","v":""},0]
[{"$f":"IF(ISERROR('Audit questions'!A29),\"\",'Audit questions'!A29)","v":"Test28"},"",{"$f":"'July-Data'!AC10","v":""},{"$f":"'July-Data'!AC12","v":""},{"$f":"'July-Data'!AC11","v":""},0]
[{"$f":"IF(ISERROR('Audit questions'!A30),\"\",'Audit questions'!A30)","v":"Test29"},"",{"$f":"'July-Data'!AD10","v":""},{"$f":"'July-Data'!AD12","v":""},{"$f":"'July-Data'!AD11","v":""},0]
[{"$f":"IF(ISERROR('Audit questions'!A31),\"\",'Audit questions'!A31)","v":"Test30"},"",{"$f":"'July-Data'!AE10","v":""},{"$f":"'July-Data'!AE12","v":""},{"$f":"'July-Data'!AE11","v":""},0]
[{"$f":"IF(ISERROR('Audit questions'!A32),\"\",'Audit questions'!A32)","v":"Test31"},"",{"$f":"'July-Data'!AF10","v":""},{"$f":"'July-Data'!AF12","v":""},{"$f":"'July-Data'!AF11","v":""},0]
[{"$f":"IF(ISERROR('Audit questions'!A33),\"\",'Audit questions'!A33)","v":"Test32"},"",{"$f":"'July-Data'!AG10","v":""},{"$f":"'July-Data'!AG12","v":""},{"$f":"'July-Data'!AG11","v":""},0]
[{"$f":"IF(ISERROR('Audit questions'!A34),\"\",'Audit questions'!A34)","v":"Test33"},"",{"$f":"'July-Data'!AH10","v":""},{"$f":"'July-Data'!AH12","v":""},{"$f":"'July-Data'!AH11","v":""},0]
[{"$f":"IF(ISERROR('Audit questions'!A35),\"\",'Audit questions'!A35)","v":"Test34"},"",{"$f":"'July-Data'!AI10","v":""},{"$f":"'July-Data'!AI12","v":""},{"$f":"'July-Data'!AI11","v":""},0]
[{"$f":"IF(ISERROR('Audit questions'!A36),\"\",'Audit questions'!A36)","v":"Test35"},"",{"$f":"'July-Data'!AJ10","v":""},{"$f":"'July-Data'!AJ12","v":""},{"$f":"'July-Data'!AJ11","v":""},0]
[{"$f":"IF(ISERROR('Audit questions'!A37),\"\",'Audit questions'!A37)","v":"Test36"},"",{"$f":"'July-Data'!AK10","v":""},{"$f":"'July-Data'!AK12","v":""},{"$f":"'July-Data'!AK11","v":""},0]
[{"$f":"IF(ISERROR('Audit questions'!A38),\"\",'Audit questions'!A38)","v":"Test37"},"",{"$f":"'July-Data'!AL10","v":""},{"$f":"'July-Data'!AL12","v":""},{"$f":"'July-Data'!AL11","v":""},0]
[{"$f":"IF(ISERROR('Audit questions'!A39),\"\",'Audit questions'!A39)","v":"Test38"},"",{"$f":"'July-Data'!AM10","v":""},{"$f":"'July-Data'!AM12","v":""},{"$f":"'July-Data'!AM11","v":""},0]
[{"$f":"IF(ISERROR('Audit questions'!A40),\"\",'Audit questions'!A40)","v":"Test39"},"",{"$f":"'July-Data'!AN10","v":""},{"$f":"'July-Data'!AN12","v":""},{"$f":"'July-Data'!AN11","v":""},0]
[{"$f":"IF(ISERROR('Audit questions'!A41),\"\",'Audit questions'!A41)","v":"Test40"},"",{"$f":"'July-Data'!AO10","v":""},{"$f":"'July-Data'!AO12","v":""},{"$f":"'July-Data'!AO11","v":""},0]
[null,null,null,null,null,null,{"$f":"COUNTIF(F11:F50,\">=1\")","v":0}]

{"sheet":"July-Raw","index":16,"n_rows":2,"n_cols":87,"rows_kept":2,"cut":false,"hidden":true,"merged":[[0,85,0,86],[0,63,0,64],[0,65,0,66],[0,67,0,68],[0,69,0,70],[0,71,0,72],[0,73,0,74],[0,75,0,76],[0,77,0,78],[0,79,0,80],[0,81,0,82],[0,83,0,84],[0,61,0,62],[0,39,0,40],[0,41,0,42],[0,43,0,44],[0,45,0,46],[0,47,0,48],[0,49,0,50],[0,51,0,52],[0,53,0,54],[0,55,0,56],[0,57,0,58],[0,59,0,60],[0,37,0,38],[0,15,0,16],[0,17,0,18],[0,19,0,20],[0,21,0,22],[0,23,0,24],[0,25,0,26],[0,27,0,28],[0,29,0,30],[0,31,0,32],[0,33,0,34],[0,35,0,36],[0,13,0,14],[0,0,0,5],[0,6,1,6],[0,7,0,8],[0,9,0,10],[0,11,0,12]]}
["Record details",null,null,null,null,null,"Notes",{"$f":"'Audit questions'!A2","v":"Test1"},null,{"$f":"'Audit questions'!A3","v":"Test2"},null,{"$f":"'Audit questions'!A4","v":"Test3"},null,{"$f":"'Audit questions'!A5","v":"Test4"},null,{"$f":"'Audit questions'!A6","v":"Test5"},null,{"$f":"'Audit questions'!A7","v":"Test6"},null,{"$f":"'Audit questions'!A8","v":"Test7"},null,{"$f":"'Audit questions'!A9","v":"Test8"},null,{"$f":"'Audit questions'!A10","v":"Test9"},null,{"$f":"'Audit questions'!A11","v":"Test10"},null,{"$f":"'Audit questions'!A12","v":"Test11"},null,{"$f":"'Audit questions'!A13","v":"Test12"},null,{"$f":"'Audit questions'!A14","v":"Test13"},null,{"$f":"'Audit questions'!A15","v":"Test14"},null,{"$f":"'Audit questions'!A16","v":"Test15"},null,{"$f":"'Audit questions'!A17","v":"Test16"},null,{"$f":"'Audit questions'!A18","v":"Test17"},null,{"$f":"'Audit questions'!A19","v":"Test18"},null,{"$f":"'Audit questions'!A20","v":"Test19"},null,{"$f":"'Audit questions'!A21","v":"Test20"},null,{"$f":"'Audit questions'!A22","v":"Test21"},null,{"$f":"'Audit questions'!A23","v":"Test22"},null,{"$f":"'Audit questions'!A24","v":"Test23"},null,{"$f":"'Audit questions'!A25","v":"Test24"},null,{"$f":"'Audit questions'!A26","v":"Test25"},null,{"$f":"'Audit questions'!A27","v":"Test26"},null,{"$f":"'Audit questions'!A28","v":"Test27"},null,{"$f":"'Audit questions'!A29","v":"Test28"},null,{"$f":"'Audit questions'!A30","v":"Test29"},null,{"$f":"'Audit questions'!A31","v":"Test30"},null,{"$f":"'Audit questions'!A32","v":"Test31"},null,{"$f":"'Audit questions'!A33","v":"Test32"},null,{"$f":"'Audit questions'!A34","v":"Test33"},null,{"$f":"'Audit questions'!A35","v":"Test34"},null,{"$f":"'Audit questions'!A36","v":"Test35"},null,{"$f":"'Audit questions'!A37","v":"Test36"},null,{"$f":"'Audit questions'!A38","v":"Test37"},null,{"$f":"'Audit questions'!A39","v":"Test38"},null,{"$f":"'Audit questions'!A40","v":"Test39"},null,{"$f":"'Audit questions'!A41","v":"Test40"}]
["Pt number","Date seen","Clinician 1","clinician 2","New/ F-up","Apt code",null,"Compliant?","Other result","Compliant?","Other result","Compliant?","Other result","Compliant?","Other result","Compliant?","Other result","Compliant?","Other result","Compliant?","Other result","Compliant?","Other result","Compliant?","Other result","Compliant?","Other result","Compliant?","Other result","Compliant?","Other result","Compliant?","Other result","Compliant?","Other result","Compliant?","Other result","Compliant?","Other result","Compliant?","Other result","Compliant?","Other result","Compliant?","Other result","Compliant?","Other result","Compliant?","Other result","Compliant?","Other result","Compliant?","Other result","Compliant?","Other result","Compliant?","Other result","Compliant?","Other result","Compliant?","Other result","Compliant?","Other result","Compliant?","Other result","Compliant?","Other result","Compliant?","Other result","Compliant?","Other result","Compliant?","Other result","Compliant?","Other result","Compliant?","Other result","Compliant?","Other result","Compliant?","Other result","Compliant?","Other result","Compliant?","Other result","Compliant?","Other result"]

{"sheet":"July-Data","index":17,"n_rows":12,"n_cols":41,"rows_kept":12,"cut":false,"hidden":true,"merged":[[0,0,1,0]]}
["Results",{"$f":"'Audit questions'!A2","v":"Test1"},{"$f":"'Audit questions'!A3","v":"Test2"},{"$f":"'Audit questions'!A4","v":"Test3"},{"$f":"'Audit questions'!A5","v":"Test4"},{"$f":"'Audit questions'!A6","v":"Test5"},{"$f":"'Audit questions'!A7","v":"Test6"},{"$f":"'Audit questions'!A8","v":"Test7"},{"$f":"'Audit questions'!A9","v":"Test8"},{"$f":"'Audit questions'!A10","v":"Test9"},{"$f":"'Audit questions'!A11","v":"Test10"},{"$f":"'Audit questions'!A12","v":"Test11"},{"$f":"'Audit questions'!A13","v":"Test12"},{"$f":"'Audit questions'!A14","v":"Test13"},{"$f":"'Audit questions'!A15","v":"Test14"},{"$f":"'Audit questions'!A16","v":"Test15"},{"$f":"'Audit questions'!A17","v":"Test16"},{"$f":"'Audit questions'!A18","v":"Test17"},{"$f":"'Audit questions'!A19","v":"Test18"},{"$f":"'Audit questions'!A20","v":"Test19"},{"$f":"'Audit questions'!A21","v":"Test20"},{"$f":"'Audit questions'!A22","v":"Test21"},{"$f":"'Audit questions'!A23","v":"Test22"},{"$f":"'Audit questions'!A24","v":"Test23"},{"$f":"'Audit questions'!A25","v":"Test24"},{"$f":"'Audit questions'!A26","v":"Test25"},{"$f":"'Audit questions'!A27","v":"Test26"},{"$f":"'Audit questions'!A28","v":"Test27"},{"$f":"'Audit questions'!A29","v":"Test28"},{"$f":"'Audit questions'!A30","v":"Test29"},{"$f":"'Audit questions'!A31","v":"Test30"},{"$f":"'Audit questions'!A32","v":"Test31"},{"$f":"'Audit questions'!A33","v":"Test32"},{"$f":"'Audit questions'!A34","v":"Test33"},{"$f":"'Audit questions'!A35","v":"Test34"},{"$f":"'Audit questions'!A36","v":"Test35"},{"$f":"'Audit questions'!A37","v":"Test36"},{"$f":"'Audit questions'!A38","v":"Test37"},{"$f":"'Audit questions'!A39","v":"Test38"},{"$f":"'Audit questions'!A40","v":"Test39"},{"$f":"'Audit questions'!A41","v":"Test40"}]
[null,"Compliant?","Compliant?","Compliant?","Compliant?","Compliant?","Compliant?","Compliant?","Compliant?","Compliant?","Compliant?","Compliant?","Compliant?","Compliant?","Compliant?","Compliant?","Compliant?","Compliant?","Compliant?","Compliant?","Compliant?","Compliant?","Compliant?","Compliant?","Compliant?","Compliant?","Compliant?","Compliant?","Compliant?","Compliant?","Compliant?","Compliant?","Compliant?","Compliant?","Compliant?","Compliant?","Compliant?","Compliant?","Compliant?","Compliant?","Compliant?"]
["Total Y",{"$f":"COUNTIF('July-Raw'!H:H,\"yes\")","v":0},{"$f":"COUNTIF('July-Raw'!J:J,\"yes\")","v":0},{"$f":"COUNTIF('July-Raw'!L:L,\"yes\")","v":0},{"$f":"COUNTIF('July-Raw'!N:N,\"yes\")","v":0},{"$f":"COUNTIF('July-Raw'!P:P,\"yes\")","v":0},{"$f":"COUNTIF('July-Raw'!R:R,\"yes\")","v":0},{"$f":"COUNTIF('July-Raw'!T:T,\"yes\")","v":0},{"$f":"COUNTIF('July-Raw'!V:V,\"yes\")","v":0},{"$f":"COUNTIF('July-Raw'!X:X,\"yes\")","v":0},{"$f":"COUNTIF('July-Raw'!Z:Z,\"yes\")","v":0},{"$f":"COUNTIF('July-Raw'!AB:AB,\"yes\")","v":0},{"$f":"COUNTIF('July-Raw'!AD:AD,\"yes\")","v":0},{"$f":"COUNTIF('July-Raw'!AF:AF,\"yes\")","v":0},{"$f":"COUNTIF('July-Raw'!AH:AH,\"yes\")","v":0},{"$f":"COUNTIF('July-Raw'!AJ:AJ,\"yes\")","v":0},{"$f":"COUNTIF('July-Raw'!AL:AL,\"yes\")","v":0},{"$f":"COUNTIF('July-Raw'!AN:AN,\"yes\")","v":0},{"$f":"COUNTIF('July-Raw'!AP:AP,\"yes\")","v":0},{"$f":"COUNTIF('July-Raw'!AR:AR,\"yes\")","v":0},{"$f":"COUNTIF('July-Raw'!AT:AT,\"yes\")","v":0},{"$f":"COUNTIF('July-Raw'!AV:AV,\"yes\")","v":0},{"$f":"COUNTIF('July-Raw'!AX:AX,\"yes\")","v":0},{"$f":"COUNTIF('July-Raw'!AZ:AZ,\"yes\")","v":0},{"$f":"COUNTIF('July-Raw'!BB:BB,\"yes\")","v":0},{"$f":"COUNTIF('July-Raw'!BD:BD,\"yes\")","v":0},{"$f":"COUNTIF('July-Raw'!BF:BF,\"yes\")","v":0},{"$f":"COUNTIF('July-Raw'!BH:BH,\"yes\")","v":0},{"$f":"COUNTIF('July-Raw'!BJ:BJ,\"yes\")","v":0},{"$f":"COUNTIF('July-Raw'!BL:BL,\"yes\")","v":0},{"$f":"COUNTIF('July-Raw'!BN:BN,\"yes\")","v":0},{"$f":"COUNTIF('July-Raw'!BP:BP,\"yes\")","v":0},{"$f":"COUNTIF('July-Raw'!BR:BR,\"yes\")","v":0},{"$f":"COUNTIF('July-Raw'!BT:BT,\"yes\")","v":0},{"$f":"COUNTIF('July-Raw'!BV:BV,\"yes\")","v":0},{"$f":"COUNTIF('July-Raw'!BX:BX,\"yes\")","v":0},{"$f":"COUNTIF('July-Raw'!BZ:BZ,\"yes\")","v":0},{"$f":"COUNTIF('July-Raw'!CB:CB,\"yes\")","v":0},{"$f":"COUNTIF('July-Raw'!CD:CD,\"yes\")","v":0},{"$f":"COUNTIF('July-Raw'!CF:CF,\"yes\")","v":0},{"$f":"COUNTIF('July-Raw'!CH:CH,\"yes\")","v":0}]
["Total N",{"$f":"COUNTIF('July-Raw'!H:H,\"no\")","v":0},{"$f":"COUNTIF('July-Raw'!J:J,\"no\")","v":0},{"$f":"COUNTIF('July-Raw'!L:L,\"no\")","v":0},{"$f":"COUNTIF('July-Raw'!N:N,\"no\")","v":0},{"$f":"COUNTIF('July-Raw'!P:P,\"no\")","v":0},{"$f":"COUNTIF('July-Raw'!R:R,\"no\")","v":0},{"$f":"COUNTIF('July-Raw'!T:T,\"no\")","v":0},{"$f":"COUNTIF('July-Raw'!V:V,\"no\")","v":0},{"$f":"COUNTIF('July-Raw'!X:X,\"no\")","v":0},{"$f":"COUNTIF('July-Raw'!Z:Z,\"no\")","v":0},{"$f":"COUNTIF('July-Raw'!AB:AB,\"no\")","v":0},{"$f":"COUNTIF('July-Raw'!AD:AD,\"no\")","v":0},{"$f":"COUNTIF('July-Raw'!AF:AF,\"no\")","v":0},{"$f":"COUNTIF('July-Raw'!AH:AH,\"no\")","v":0},{"$f":"COUNTIF('July-Raw'!AJ:AJ,\"no\")","v":0},{"$f":"COUNTIF('July-Raw'!AL:AL,\"no\")","v":0},{"$f":"COUNTIF('July-Raw'!AN:AN,\"no\")","v":0},{"$f":"COUNTIF('July-Raw'!AP:AP,\"no\")","v":0},{"$f":"COUNTIF('July-Raw'!AR:AR,\"no\")","v":0},{"$f":"COUNTIF('July-Raw'!AT:AT,\"no\")","v":0},{"$f":"COUNTIF('July-Raw'!AV:AV,\"no\")","v":0},{"$f":"COUNTIF('July-Raw'!AX:AX,\"no\")","v":0},{"$f":"COUNTIF('July-Raw'!AZ:AZ,\"no\")","v":0},{"$f":"COUNTIF('July-Raw'!BB:BB,\"no\")","v":0},{"$f":"COUNTIF('July-Raw'!BD:BD,\"no\")","v":0},{"$f":"COUNTIF('July-Raw'!BF:BF,\"no\")","v":0},{"$f":"COUNTIF('July-Raw'!BH:BH,\"no\")","v":0},{"$f":"COUNTIF('July-Raw'!BJ:BJ,\"no\")","v":0},{"$f":"COUNTIF('July-Raw'!BL:BL,\"no\")","v":0},{"$f":"COUNTIF('July-Raw'!BN:BN,\"no\")","v":0},{"$f":"COUNTIF('July-Raw'!BP:BP,\"no\")","v":0},{"$f":"COUNTIF('July-Raw'!BR:BR,\"no\")","v":0},{"$f":"COUNTIF('July-Raw'!BT:BT,\"no\")","v":0},{"$f":"COUNTIF('July-Raw'!BV:BV,\"no\")","v":0},{"$f":"COUNTIF('July-Raw'!BX:BX,\"no\")","v":0},{"$f":"COUNTIF('July-Raw'!BZ:BZ,\"no\")","v":0},{"$f":"COUNTIF('July-Raw'!CB:CB,\"no\")","v":0},{"$f":"COUNTIF('July-Raw'!CD:CD,\"no\")","v":0},{"$f":"COUNTIF('July-Raw'!CF:CF,\"no\")","v":0},{"$f":"COUNTIF('July-Raw'!CH:CH,\"no\")","v":0}]
["Total Justified",{"$f":"COUNTIF('July-Raw'!H:H,\"Justified\")","v":0},{"$f":"COUNTIF('July-Raw'!J:J,\"Justified\")","v":0},{"$f":"COUNTIF('July-Raw'!L:L,\"Justified\")","v":0},{"$f":"COUNTIF('July-Raw'!N:N,\"Justified\")","v":0},{"$f":"COUNTIF('July-Raw'!P:P,\"Justified\")","v":0},{"$f":"COUNTIF('July-Raw'!R:R,\"Justified\")","v":0},{"$f":"COUNTIF('July-Raw'!T:T,\"Justified\")","v":0},{"$f":"COUNTIF('July-Raw'!V:V,\"Justified\")","v":0},{"$f":"COUNTIF('July-Raw'!X:X,\"Justified\")","v":0},{"$f":"COUNTIF('July-Raw'!Z:Z,\"Justified\")","v":0},{"$f":"COUNTIF('July-Raw'!AB:AB,\"Justified\")","v":0},{"$f":"COUNTIF('July-Raw'!AD:AD,\"Justified\")","v":0},{"$f":"COUNTIF('July-Raw'!AF:AF,\"Justified\")","v":0},{"$f":"COUNTIF('July-Raw'!AH:AH,\"Justified\")","v":0},{"$f":"COUNTIF('July-Raw'!AJ:AJ,\"Justified\")","v":0},{"$f":"COUNTIF('July-Raw'!AL:AL,\"Justified\")","v":0},{"$f":"COUNTIF('July-Raw'!AN:AN,\"Justified\")","v":0},{"$f":"COUNTIF('July-Raw'!AP:AP,\"Justified\")","v":0},{"$f":"COUNTIF('July-Raw'!AR:AR,\"Justified\")","v":0},{"$f":"COUNTIF('July-Raw'!AT:AT,\"Justified\")","v":0},{"$f":"COUNTIF('July-Raw'!AV:AV,\"Justified\")","v":0},{"$f":"COUNTIF('July-Raw'!AX:AX,\"Justified\")","v":0},{"$f":"COUNTIF('July-Raw'!AZ:AZ,\"Justified\")","v":0},{"$f":"COUNTIF('July-Raw'!BB:BB,\"Justified\")","v":0},{"$f":"COUNTIF('July-Raw'!BD:BD,\"Justified\")","v":0},{"$f":"COUNTIF('July-Raw'!BF:BF,\"Justified\")","v":0},{"$f":"COUNTIF('July-Raw'!BH:BH,\"Justified\")","v":0},{"$f":"COUNTIF('July-Raw'!BJ:BJ,\"Justified\")","v":0},{"$f":"COUNTIF('July-Raw'!BL:BL,\"Justified\")","v":0},{"$f":"COUNTIF('July-Raw'!BN:BN,\"Justified\")","v":0},{"$f":"COUNTIF('July-Raw'!BP:BP,\"Justified\")","v":0},{"$f":"COUNTIF('July-Raw'!BR:BR,\"Justified\")","v":0},{"$f":"COUNTIF('July-Raw'!BT:BT,\"Justified\")","v":0},{"$f":"COUNTIF('July-Raw'!BV:BV,\"Justified\")","v":0},{"$f":"COUNTIF('July-Raw'!BX:BX,\"Justified\")","v":0},{"$f":"COUNTIF('July-Raw'!BZ:BZ,\"Justified\")","v":0},{"$f":"COUNTIF('July-Raw'!CB:CB,\"Justified\")","v":0},{"$f":"COUNTIF('July-Raw'!CD:CD,\"Justified\")","v":0},{"$f":"COUNTIF('July-Raw'!CF:CF,\"Justified\")","v":0},{"$f":"COUNTIF('July-Raw'!CH:CH,\"Justified\")","v":0}]
["Total NA",{"$f":"COUNTIF('July-Raw'!H:H,\"NA\")","v":0},{"$f":"COUNTIF('July-Raw'!J:J,\"NA\")","v":0},{"$f":"COUNTIF('July-Raw'!L:L,\"NA\")","v":0},{"$f":"COUNTIF('July-Raw'!N:N,\"NA\")","v":0},{"$f":"COUNTIF('July-Raw'!P:P,\"NA\")","v":0},{"$f":"COUNTIF('July-Raw'!R:R,\"NA\")","v":0},{"$f":"COUNTIF('July-Raw'!T:T,\"NA\")","v":0},{"$f":"COUNTIF('July-Raw'!V:V,\"NA\")","v":0},{"$f":"COUNTIF('July-Raw'!X:X,\"NA\")","v":0},{"$f":"COUNTIF('July-Raw'!Z:Z,\"NA\")","v":0},{"$f":"COUNTIF('July-Raw'!AB:AB,\"NA\")","v":0},{"$f":"COUNTIF('July-Raw'!AD:AD,\"NA\")","v":0},{"$f":"COUNTIF('July-Raw'!AF:AF,\"NA\")","v":0},{"$f":"COUNTIF('July-Raw'!AH:AH,\"NA\")","v":0},{"$f":"COUNTIF('July-Raw'!AJ:AJ,\"NA\")","v":0},{"$f":"COUNTIF('July-Raw'!AL:AL,\"NA\")","v":0},{"$f":"COUNTIF('July-Raw'!AN:AN,\"NA\")","v":0},{"$f":"COUNTIF('July-Raw'!AP:AP,\"NA\")","v":0},{"$f":"COUNTIF('July-Raw'!AR:AR,\"NA\")","v":0},{"$f":"COUNTIF('July-Raw'!AT:AT,\"NA\")","v":0},{"$f":"COUNTIF('July-Raw'!AV:AV,\"NA\")","v":0},{"$f":"COUNTIF('July-Raw'!AX:AX,\"NA\")","v":0},{"$f":"COUNTIF('July-Raw'!AZ:AZ,\"NA\")","v":0},{"$f":"COUNTIF('July-Raw'!BB:BB,\"NA\")","v":0},{"$f":"COUNTIF('July-Raw'!BD:BD,\"NA\")","v":0},{"$f":"COUNTIF('July-Raw'!BF:BF,\"NA\")","v":0},{"$f":"COUNTIF('July-Raw'!BH:BH,\"NA\")","v":0},{"$f":"COUNTIF('July-Raw'!BJ:BJ,\"NA\")","v":0},{"$f":"COUNTIF('July-Raw'!BL:BL,\"NA\")","v":0},{"$f":"COUNTIF('July-Raw'!BN:BN,\"NA\")","v":0},{"$f":"COUNTIF('July-Raw'!BP:BP,\"NA\")","v":0},{"$f":"COUNTIF('July-Raw'!BR:BR,\"NA\")","v":0},{"$f":"COUNTIF('July-Raw'!BT:BT,\"NA\")","v":0},{"$f":"COUNTIF('July-Raw'!BV:BV,\"NA\")","v":0},{"$f":"COUNTIF('July-Raw'!BX:BX,\"NA\")","v":0},{"$f":"COUNTIF('July-Raw'!BZ:BZ,\"NA\")","v":0},{"$f":"COUNTIF('July-Raw'!CB:CB,\"NA\")","v":0},{"$f":"COUNTIF('July-Raw'!CD:CD,\"NA\")","v":0},{"$f":"COUNTIF('July-Raw'!CF:CF,\"NA\")","v":0},{"$f":"COUNTIF('July-Raw'!CH:CH,\"NA\")","v":0}]
["Blanks",{"$f":"B8-(SUM(B3:B6))","v":0},{"$f":"C8-(SUM(C3:C6))","v":0},0,0,0,0,0,0,0,0,0,0,0,0,0,0,0,0,0,0,0,0,0,0,0,0,0,0,0,0,0,0,0,0,0,0,0,0,0,0]
["full sample size",{"$f":"COUNTA('July-Raw'!A:A)-2","v":0},{"$f":"B8","v":0},0,0,0,0,0,0,0,0,0,0,0,0,0,0,0,0,0,0,0,0,0,0,0,0,0,0,0,0,0,0,0,0,0,0,0,0,0,0]
["True sample size (-NA + blanks)",{"$f":"IF(ISERROR(B8-(B6+B7)),\"\",B8-(B6+B7))","v":0},{"$f":"IF(ISERROR(C8-(C6+C7)),\"\",C8-(C6+C7))","v":0},0,0,0,0,0,0,0,0,0,0,0,0,0,0,0,0,0,0,0,0,0,0,0,0,0,0,0,0,0,0,0,0,0,0,0,0,0,0]
["%Y",{"$f":"IF(ISERROR(B3/B9),\"\",B3/B9)","v":""},{"$f":"IF(ISERROR(C3/C9),\"\",C3/C9)","v":""},"","","","","","","","","","","","","","","","","","","","","","","","","","","","","","","","","","","","","",""]
["%N",{"$f":"IF(ISERROR(B4/B9),\"\",B4/B9)","v":""},{"$f":"IF(ISERROR(C4/C9),\"\",C4/C9)","v":""},"","","","","","","","","","","","","","","","","","","","","","","","","","","","","","","","","","","","","",""]
["%N - Justified",{"$f":"IF(ISERROR(B5/B9),\"\",B5/B9)","v":""},{"$f":"IF(ISERROR(C5/C9),\"\",C5/C9)","v":""},"","","","","","","","","","","","","","","","","","","","","","","","","","","","","","","","","","","","","",""]

{"sheet":"Aug","index":18,"n_rows":51,"n_cols":8,"rows_kept":51,"cut":false,"hidden":false,"merged":[]}
["Click here to go to year overview"]
[]
["Date",null,null,"Total by Apt type"]
["Completed by",null,null,"New",{"$f":"COUNTIF('Aug-Raw'!E3:E103,\"New\")","v":0}]
["Sample group size",{"$f":"COUNTA('Aug-Raw'!A:A)-2","v":0},null,"Follow up",{"$f":"COUNTIF('Aug-Raw'!E3:E103,\"Fup\")","v":0},null,null,{"$f":"Year!H5","v":0.95}]
["Overall Result (compliant only)",{"$f":"IF(ISERROR(SUM(C11:C50)/G51),\"\",SUM(C11:C50)/G51)","v":""},null,"Total by apt Code",null,null,null,{"$f":"Year!H6","v":"80-95%"}]
["Overall Result (compliant & Justified)",{"$f":"IF(ISERROR(SUM(B11:B50)/G51),\"\",SUM(B11:B50)/G51)","v":""},null,"code goes in here",{"$f":"COUNTIF('Aug-Raw'!F3:F103,D7)","v":0},null,null,{"$f":"Year!H7","v":0.8}]
["viable qs",{"$f":"G51","v":0}]
[]
["Metric","Compliant + Justified","Compliant","Justified","Not compliant","Irritating math"]
[{"$f":"IF(ISERROR('Audit questions'!A2),\"\",'Audit questions'!A2)","v":"Test1"},{"$f":"IF(ISERROR(C11+D11),\"\",C11+D11)","v":""},{"$f":"'Aug-Data'!B10","v":""},{"$f":"'Aug-Data'!B12","v":""},{"$f":"'Aug-Data'!B11","v":""},{"$f":"COUNTIF(C11:E11,\">0\")","v":0}]
[{"$f":"IF(ISERROR('Audit questions'!A3),\"\",'Audit questions'!A3)","v":"Test2"},"",{"$f":"'Aug-Data'!C10","v":""},{"$f":"'Aug-Data'!C12","v":""},{"$f":"'Aug-Data'!C11","v":""},0]
[{"$f":"IF(ISERROR('Audit questions'!A4),\"\",'Audit questions'!A4)","v":"Test3"},"",{"$f":"'Aug-Data'!D10","v":""},{"$f":"'Aug-Data'!D12","v":""},{"$f":"'Aug-Data'!D11","v":""},0]
[{"$f":"IF(ISERROR('Audit questions'!A5),\"\",'Audit questions'!A5)","v":"Test4"},"",{"$f":"'Aug-Data'!E10","v":""},{"$f":"'Aug-Data'!E12","v":""},{"$f":"'Aug-Data'!E11","v":""},0]
[{"$f":"IF(ISERROR('Audit questions'!A6),\"\",'Audit questions'!A6)","v":"Test5"},"",{"$f":"'Aug-Data'!F10","v":""},{"$f":"'Aug-Data'!F12","v":""},{"$f":"'Aug-Data'!F11","v":""},0]
[{"$f":"IF(ISERROR('Audit questions'!A7),\"\",'Audit questions'!A7)","v":"Test6"},"",{"$f":"'Aug-Data'!G10","v":""},{"$f":"'Aug-Data'!G12","v":""},{"$f":"'Aug-Data'!G11","v":""},0]
[{"$f":"IF(ISERROR('Audit questions'!A8),\"\",'Audit questions'!A8)","v":"Test7"},"",{"$f":"'Aug-Data'!H10","v":""},{"$f":"'Aug-Data'!H12","v":""},{"$f":"'Aug-Data'!H11","v":""},0]
[{"$f":"IF(ISERROR('Audit questions'!A9),\"\",'Audit questions'!A9)","v":"Test8"},"",{"$f":"'Aug-Data'!I10","v":""},{"$f":"'Aug-Data'!I12","v":""},{"$f":"'Aug-Data'!I11","v":""},0]
[{"$f":"IF(ISERROR('Audit questions'!A10),\"\",'Audit questions'!A10)","v":"Test9"},"",{"$f":"'Aug-Data'!J10","v":""},{"$f":"'Aug-Data'!J12","v":""},{"$f":"'Aug-Data'!J11","v":""},0]
[{"$f":"IF(ISERROR('Audit questions'!A11),\"\",'Audit questions'!A11)","v":"Test10"},"",{"$f":"'Aug-Data'!K10","v":""},{"$f":"'Aug-Data'!K12","v":""},{"$f":"'Aug-Data'!K11","v":""},0]
[{"$f":"IF(ISERROR('Audit questions'!A12),\"\",'Audit questions'!A12)","v":"Test11"},"",{"$f":"'Aug-Data'!L10","v":""},{"$f":"'Aug-Data'!L12","v":""},{"$f":"'Aug-Data'!L11","v":""},0]
[{"$f":"IF(ISERROR('Audit questions'!A13),\"\",'Audit questions'!A13)","v":"Test12"},"",{"$f":"'Aug-Data'!M10","v":""},{"$f":"'Aug-Data'!M12","v":""},{"$f":"'Aug-Data'!M11","v":""},0]
[{"$f":"IF(ISERROR('Audit questions'!A14),\"\",'Audit questions'!A14)","v":"Test13"},"",{"$f":"'Aug-Data'!N10","v":""},{"$f":"'Aug-Data'!N12","v":""},{"$f":"'Aug-Data'!N11","v":""},0]
[{"$f":"IF(ISERROR('Audit questions'!A15),\"\",'Audit questions'!A15)","v":"Test14"},"",{"$f":"'Aug-Data'!O10","v":""},{"$f":"'Aug-Data'!O12","v":""},{"$f":"'Aug-Data'!O11","v":""},0]
[{"$f":"IF(ISERROR('Audit questions'!A16),\"\",'Audit questions'!A16)","v":"Test15"},"",{"$f":"'Aug-Data'!P10","v":""},{"$f":"'Aug-Data'!P12","v":""},{"$f":"'Aug-Data'!P11","v":""},0]
[{"$f":"IF(ISERROR('Audit questions'!A17),\"\",'Audit questions'!A17)","v":"Test16"},"",{"$f":"'Aug-Data'!Q10","v":""},{"$f":"'Aug-Data'!Q12","v":""},{"$f":"'Aug-Data'!Q11","v":""},0]
[{"$f":"IF(ISERROR('Audit questions'!A18),\"\",'Audit questions'!A18)","v":"Test17"},"",{"$f":"'Aug-Data'!R10","v":""},{"$f":"'Aug-Data'!R12","v":""},{"$f":"'Aug-Data'!R11","v":""},0]
[{"$f":"IF(ISERROR('Audit questions'!A19),\"\",'Audit questions'!A19)","v":"Test18"},"",{"$f":"'Aug-Data'!S10","v":""},{"$f":"'Aug-Data'!S12","v":""},{"$f":"'Aug-Data'!S11","v":""},0]
[{"$f":"IF(ISERROR('Audit questions'!A20),\"\",'Audit questions'!A20)","v":"Test19"},"",{"$f":"'Aug-Data'!T10","v":""},{"$f":"'Aug-Data'!T12","v":""},{"$f":"'Aug-Data'!T11","v":""},0]
[{"$f":"IF(ISERROR('Audit questions'!A21),\"\",'Audit questions'!A21)","v":"Test20"},"",{"$f":"'Aug-Data'!U10","v":""},{"$f":"'Aug-Data'!U12","v":""},{"$f":"'Aug-Data'!U11","v":""},0]
[{"$f":"IF(ISERROR('Audit questions'!A22),\"\",'Audit questions'!A22)","v":"Test21"},"",{"$f":"'Aug-Data'!V10","v":""},{"$f":"'Aug-Data'!V12","v":""},{"$f":"'Aug-Data'!V11","v":""},0]
[{"$f":"IF(ISERROR('Audit questions'!A23),\"\",'Audit questions'!A23)","v":"Test22"},"",{"$f":"'Aug-Data'!W10","v":""},{"$f":"'Aug-Data'!W12","v":""},{"$f":"'Aug-Data'!W11","v":""},0]
[{"$f":"IF(ISERROR('Audit questions'!A24),\"\",'Audit questions'!A24)","v":"Test23"},"",{"$f":"'Aug-Data'!X10","v":""},{"$f":"'Aug-Data'!X12","v":""},{"$f":"'Aug-Data'!X11","v":""},0]
[{"$f":"IF(ISERROR('Audit questions'!A25),\"\",'Audit questions'!A25)","v":"Test24"},"",{"$f":"'Aug-Data'!Y10","v":""},{"$f":"'Aug-Data'!Y12","v":""},{"$f":"'Aug-Data'!Y11","v":""},0]
[{"$f":"IF(ISERROR('Audit questions'!A26),\"\",'Audit questions'!A26)","v":"Test25"},"",{"$f":"'Aug-Data'!Z10","v":""},{"$f":"'Aug-Data'!Z12","v":""},{"$f":"'Aug-Data'!Z11","v":""},0]
[{"$f":"IF(ISERROR('Audit questions'!A27),\"\",'Audit questions'!A27)","v":"Test26"},"",{"$f":"'Aug-Data'!AA10","v":""},{"$f":"'Aug-Data'!AA12","v":""},{"$f":"'Aug-Data'!AA11","v":""},0]
[{"$f":"IF(ISERROR('Audit questions'!A28),\"\",'Audit questions'!A28)","v":"Test27"},"",{"$f":"'Aug-Data'!AB10","v":""},{"$f":"'Aug-Data'!AB12","v":""},{"$f":"'Aug-Data'!AB11","v":""},0]
[{"$f":"IF(ISERROR('Audit questions'!A29),\"\",'Audit questions'!A29)","v":"Test28"},"",{"$f":"'Aug-Data'!AC10","v":""},{"$f":"'Aug-Data'!AC12","v":""},{"$f":"'Aug-Data'!AC11","v":""},0]
[{"$f":"IF(ISERROR('Audit questions'!A30),\"\",'Audit questions'!A30)","v":"Test29"},"",{"$f":"'Aug-Data'!AD10","v":""},{"$f":"'Aug-Data'!AD12","v":""},{"$f":"'Aug-Data'!AD11","v":""},0]
[{"$f":"IF(ISERROR('Audit questions'!A31),\"\",'Audit questions'!A31)","v":"Test30"},"",{"$f":"'Aug-Data'!AE10","v":""},{"$f":"'Aug-Data'!AE12","v":""},{"$f":"'Aug-Data'!AE11","v":""},0]
[{"$f":"IF(ISERROR('Audit questions'!A32),\"\",'Audit questions'!A32)","v":"Test31"},"",{"$f":"'Aug-Data'!AF10","v":""},{"$f":"'Aug-Data'!AF12","v":""},{"$f":"'Aug-Data'!AF11","v":""},0]
[{"$f":"IF(ISERROR('Audit questions'!A33),\"\",'Audit questions'!A33)","v":"Test32"},"",{"$f":"'Aug-Data'!AG10","v":""},{"$f":"'Aug-Data'!AG12","v":""},{"$f":"'Aug-Data'!AG11","v":""},0]
[{"$f":"IF(ISERROR('Audit questions'!A34),\"\",'Audit questions'!A34)","v":"Test33"},"",{"$f":"'Aug-Data'!AH10","v":""},{"$f":"'Aug-Data'!AH12","v":""},{"$f":"'Aug-Data'!AH11","v":""},0]
[{"$f":"IF(ISERROR('Audit questions'!A35),\"\",'Audit questions'!A35)","v":"Test34"},"",{"$f":"'Aug-Data'!AI10","v":""},{"$f":"'Aug-Data'!AI12","v":""},{"$f":"'Aug-Data'!AI11","v":""},0]
[{"$f":"IF(ISERROR('Audit questions'!A36),\"\",'Audit questions'!A36)","v":"Test35"},"",{"$f":"'Aug-Data'!AJ10","v":""},{"$f":"'Aug-Data'!AJ12","v":""},{"$f":"'Aug-Data'!AJ11","v":""},0]
[{"$f":"IF(ISERROR('Audit questions'!A37),\"\",'Audit questions'!A37)","v":"Test36"},"",{"$f":"'Aug-Data'!AK10","v":""},{"$f":"'Aug-Data'!AK12","v":""},{"$f":"'Aug-Data'!AK11","v":""},0]
[{"$f":"IF(ISERROR('Audit questions'!A38),\"\",'Audit questions'!A38)","v":"Test37"},"",{"$f":"'Aug-Data'!AL10","v":""},{"$f":"'Aug-Data'!AL12","v":""},{"$f":"'Aug-Data'!AL11","v":""},0]
[{"$f":"IF(ISERROR('Audit questions'!A39),\"\",'Audit questions'!A39)","v":"Test38"},"",{"$f":"'Aug-Data'!AM10","v":""},{"$f":"'Aug-Data'!AM12","v":""},{"$f":"'Aug-Data'!AM11","v":""},0]
[{"$f":"IF(ISERROR('Audit questions'!A40),\"\",'Audit questions'!A40)","v":"Test39"},"",{"$f":"'Aug-Data'!AN10","v":""},{"$f":"'Aug-Data'!AN12","v":""},{"$f":"'Aug-Data'!AN11","v":""},0]
[{"$f":"IF(ISERROR('Audit questions'!A41),\"\",'Audit questions'!A41)","v":"Test40"},"",{"$f":"'Aug-Data'!AO10","v":""},{"$f":"'Aug-Data'!AO12","v":""},{"$f":"'Aug-Data'!AO11","v":""},0]
[null,null,null,null,null,null,{"$f":"COUNTIF(F11:F50,\">=1\")","v":0}]

{"sheet":"Aug-Raw","index":19,"n_rows":2,"n_cols":87,"rows_kept":2,"cut":false,"hidden":true,"merged":[[0,85,0,86],[0,63,0,64],[0,65,0,66],[0,67,0,68],[0,69,0,70],[0,71,0,72],[0,73,0,74],[0,75,0,76],[0,77,0,78],[0,79,0,80],[0,81,0,82],[0,83,0,84],[0,61,0,62],[0,39,0,40],[0,41,0,42],[0,43,0,44],[0,45,0,46],[0,47,0,48],[0,49,0,50],[0,51,0,52],[0,53,0,54],[0,55,0,56],[0,57,0,58],[0,59,0,60],[0,37,0,38],[0,15,0,16],[0,17,0,18],[0,19,0,20],[0,21,0,22],[0,23,0,24],[0,25,0,26],[0,27,0,28],[0,29,0,30],[0,31,0,32],[0,33,0,34],[0,35,0,36],[0,13,0,14],[0,0,0,5],[0,6,1,6],[0,7,0,8],[0,9,0,10],[0,11,0,12]]}
["Record details",null,null,null,null,null,"Notes",{"$f":"'Audit questions'!A2","v":"Test1"},null,{"$f":"'Audit questions'!A3","v":"Test2"},null,{"$f":"'Audit questions'!A4","v":"Test3"},null,{"$f":"'Audit questions'!A5","v":"Test4"},null,{"$f":"'Audit questions'!A6","v":"Test5"},null,{"$f":"'Audit questions'!A7","v":"Test6"},null,{"$f":"'Audit questions'!A8","v":"Test7"},null,{"$f":"'Audit questions'!A9","v":"Test8"},null,{"$f":"'Audit questions'!A10","v":"Test9"},null,{"$f":"'Audit questions'!A11","v":"Test10"},null,{"$f":"'Audit questions'!A12","v":"Test11"},null,{"$f":"'Audit questions'!A13","v":"Test12"},null,{"$f":"'Audit questions'!A14","v":"Test13"},null,{"$f":"'Audit questions'!A15","v":"Test14"},null,{"$f":"'Audit questions'!A16","v":"Test15"},null,{"$f":"'Audit questions'!A17","v":"Test16"},null,{"$f":"'Audit questions'!A18","v":"Test17"},null,{"$f":"'Audit questions'!A19","v":"Test18"},null,{"$f":"'Audit questions'!A20","v":"Test19"},null,{"$f":"'Audit questions'!A21","v":"Test20"},null,{"$f":"'Audit questions'!A22","v":"Test21"},null,{"$f":"'Audit questions'!A23","v":"Test22"},null,{"$f":"'Audit questions'!A24","v":"Test23"},null,{"$f":"'Audit questions'!A25","v":"Test24"},null,{"$f":"'Audit questions'!A26","v":"Test25"},null,{"$f":"'Audit questions'!A27","v":"Test26"},null,{"$f":"'Audit questions'!A28","v":"Test27"},null,{"$f":"'Audit questions'!A29","v":"Test28"},null,{"$f":"'Audit questions'!A30","v":"Test29"},null,{"$f":"'Audit questions'!A31","v":"Test30"},null,{"$f":"'Audit questions'!A32","v":"Test31"},null,{"$f":"'Audit questions'!A33","v":"Test32"},null,{"$f":"'Audit questions'!A34","v":"Test33"},null,{"$f":"'Audit questions'!A35","v":"Test34"},null,{"$f":"'Audit questions'!A36","v":"Test35"},null,{"$f":"'Audit questions'!A37","v":"Test36"},null,{"$f":"'Audit questions'!A38","v":"Test37"},null,{"$f":"'Audit questions'!A39","v":"Test38"},null,{"$f":"'Audit questions'!A40","v":"Test39"},null,{"$f":"'Audit questions'!A41","v":"Test40"}]
["Pt number","Date seen","Clinician 1","clinician 2","New/ F-up","Apt code",null,"Compliant?","Other result","Compliant?","Other result","Compliant?","Other result","Compliant?","Other result","Compliant?","Other result","Compliant?","Other result","Compliant?","Other result","Compliant?","Other result","Compliant?","Other result","Compliant?","Other result","Compliant?","Other result","Compliant?","Other result","Compliant?","Other result","Compliant?","Other result","Compliant?","Other result","Compliant?","Other result","Compliant?","Other result","Compliant?","Other result","Compliant?","Other result","Compliant?","Other result","Compliant?","Other result","Compliant?","Other result","Compliant?","Other result","Compliant?","Other result","Compliant?","Other result","Compliant?","Other result","Compliant?","Other result","Compliant?","Other result","Compliant?","Other result","Compliant?","Other result","Compliant?","Other result","Compliant?","Other result","Compliant?","Other result","Compliant?","Other result","Compliant?","Other result","Compliant?","Other result","Compliant?","Other result","Compliant?","Other result","Compliant?","Other result","Compliant?","Other result"]

{"sheet":"Aug-Data","index":20,"n_rows":12,"n_cols":41,"rows_kept":12,"cut":false,"hidden":true,"merged":[[0,0,1,0]]}
["Results",{"$f":"'Audit questions'!A2","v":"Test1"},{"$f":"'Audit questions'!A3","v":"Test2"},{"$f":"'Audit questions'!A4","v":"Test3"},{"$f":"'Audit questions'!A5","v":"Test4"},{"$f":"'Audit questions'!A6","v":"Test5"},{"$f":"'Audit questions'!A7","v":"Test6"},{"$f":"'Audit questions'!A8","v":"Test7"},{"$f":"'Audit questions'!A9","v":"Test8"},{"$f":"'Audit questions'!A10","v":"Test9"},{"$f":"'Audit questions'!A11","v":"Test10"},{"$f":"'Audit questions'!A12","v":"Test11"},{"$f":"'Audit questions'!A13","v":"Test12"},{"$f":"'Audit questions'!A14","v":"Test13"},{"$f":"'Audit questions'!A15","v":"Test14"},{"$f":"'Audit questions'!A16","v":"Test15"},{"$f":"'Audit questions'!A17","v":"Test16"},{"$f":"'Audit questions'!A18","v":"Test17"},{"$f":"'Audit questions'!A19","v":"Test18"},{"$f":"'Audit questions'!A20","v":"Test19"},{"$f":"'Audit questions'!A21","v":"Test20"},{"$f":"'Audit questions'!A22","v":"Test21"},{"$f":"'Audit questions'!A23","v":"Test22"},{"$f":"'Audit questions'!A24","v":"Test23"},{"$f":"'Audit questions'!A25","v":"Test24"},{"$f":"'Audit questions'!A26","v":"Test25"},{"$f":"'Audit questions'!A27","v":"Test26"},{"$f":"'Audit questions'!A28","v":"Test27"},{"$f":"'Audit questions'!A29","v":"Test28"},{"$f":"'Audit questions'!A30","v":"Test29"},{"$f":"'Audit questions'!A31","v":"Test30"},{"$f":"'Audit questions'!A32","v":"Test31"},{"$f":"'Audit questions'!A33","v":"Test32"},{"$f":"'Audit questions'!A34","v":"Test33"},{"$f":"'Audit questions'!A35","v":"Test34"},{"$f":"'Audit questions'!A36","v":"Test35"},{"$f":"'Audit questions'!A37","v":"Test36"},{"$f":"'Audit questions'!A38","v":"Test37"},{"$f":"'Audit questions'!A39","v":"Test38"},{"$f":"'Audit questions'!A40","v":"Test39"},{"$f":"'Audit questions'!A41","v":"Test40"}]
[null,"Compliant?","Compliant?","Compliant?","Compliant?","Compliant?","Compliant?","Compliant?","Compliant?","Compliant?","Compliant?","Compliant?","Compliant?","Compliant?","Compliant?","Compliant?","Compliant?","Compliant?","Compliant?","Compliant?","Compliant?","Compliant?","Compliant?","Compliant?","Compliant?","Compliant?","Compliant?","Compliant?","Compliant?","Compliant?","Compliant?","Compliant?","Compliant?","Compliant?","Compliant?","Compliant?","Compliant?","Compliant?","Compliant?","Compliant?","Compliant?"]
["Total Y",{"$f":"COUNTIF('Aug-Raw'!H:H,\"yes\")","v":0},{"$f":"COUNTIF('Aug-Raw'!J:J,\"yes\")","v":0},{"$f":"COUNTIF('Aug-Raw'!L:L,\"yes\")","v":0},{"$f":"COUNTIF('Aug-Raw'!N:N,\"yes\")","v":0},{"$f":"COUNTIF('Aug-Raw'!P:P,\"yes\")","v":0},{"$f":"COUNTIF('Aug-Raw'!R:R,\"yes\")","v":0},{"$f":"COUNTIF('Aug-Raw'!T:T,\"yes\")","v":0},{"$f":"COUNTIF('Aug-Raw'!V:V,\"yes\")","v":0},{"$f":"COUNTIF('Aug-Raw'!X:X,\"yes\")","v":0},{"$f":"COUNTIF('Aug-Raw'!Z:Z,\"yes\")","v":0},{"$f":"COUNTIF('Aug-Raw'!AB:AB,\"yes\")","v":0},{"$f":"COUNTIF('Aug-Raw'!AD:AD,\"yes\")","v":0},{"$f":"COUNTIF('Aug-Raw'!AF:AF,\"yes\")","v":0},{"$f":"COUNTIF('Aug-Raw'!AH:AH,\"yes\")","v":0},{"$f":"COUNTIF('Aug-Raw'!AJ:AJ,\"yes\")","v":0},{"$f":"COUNTIF('Aug-Raw'!AL:AL,\"yes\")","v":0},{"$f":"COUNTIF('Aug-Raw'!AN:AN,\"yes\")","v":0},{"$f":"COUNTIF('Aug-Raw'!AP:AP,\"yes\")","v":0},{"$f":"COUNTIF('Aug-Raw'!AR:AR,\"yes\")","v":0},{"$f":"COUNTIF('Aug-Raw'!AT:AT,\"yes\")","v":0},{"$f":"COUNTIF('Aug-Raw'!AV:AV,\"yes\")","v":0},{"$f":"COUNTIF('Aug-Raw'!AX:AX,\"yes\")","v":0},{"$f":"COUNTIF('Aug-Raw'!AZ:AZ,\"yes\")","v":0},{"$f":"COUNTIF('Aug-Raw'!BB:BB,\"yes\")","v":0},{"$f":"COUNTIF('Aug-Raw'!BD:BD,\"yes\")","v":0},{"$f":"COUNTIF('Aug-Raw'!BF:BF,\"yes\")","v":0},{"$f":"COUNTIF('Aug-Raw'!BH:BH,\"yes\")","v":0},{"$f":"COUNTIF('Aug-Raw'!BJ:BJ,\"yes\")","v":0},{"$f":"COUNTIF('Aug-Raw'!BL:BL,\"yes\")","v":0},{"$f":"COUNTIF('Aug-Raw'!BN:BN,\"yes\")","v":0},{"$f":"COUNTIF('Aug-Raw'!BP:BP,\"yes\")","v":0},{"$f":"COUNTIF('Aug-Raw'!BR:BR,\"yes\")","v":0},{"$f":"COUNTIF('Aug-Raw'!BT:BT,\"yes\")","v":0},{"$f":"COUNTIF('Aug-Raw'!BV:BV,\"yes\")","v":0},{"$f":"COUNTIF('Aug-Raw'!BX:BX,\"yes\")","v":0},{"$f":"COUNTIF('Aug-Raw'!BZ:BZ,\"yes\")","v":0},{"$f":"COUNTIF('Aug-Raw'!CB:CB,\"yes\")","v":0},{"$f":"COUNTIF('Aug-Raw'!CD:CD,\"yes\")","v":0},{"$f":"COUNTIF('Aug-Raw'!CF:CF,\"yes\")","v":0},{"$f":"COUNTIF('Aug-Raw'!CH:CH,\"yes\")","v":0}]
["Total N",{"$f":"COUNTIF('Aug-Raw'!H:H,\"no\")","v":0},{"$f":"COUNTIF('Aug-Raw'!J:J,\"no\")","v":0},{"$f":"COUNTIF('Aug-Raw'!L:L,\"no\")","v":0},{"$f":"COUNTIF('Aug-Raw'!N:N,\"no\")","v":0},{"$f":"COUNTIF('Aug-Raw'!P:P,\"no\")","v":0},{"$f":"COUNTIF('Aug-Raw'!R:R,\"no\")","v":0},{"$f":"COUNTIF('Aug-Raw'!T:T,\"no\")","v":0},{"$f":"COUNTIF('Aug-Raw'!V:V,\"no\")","v":0},{"$f":"COUNTIF('Aug-Raw'!X:X,\"no\")","v":0},{"$f":"COUNTIF('Aug-Raw'!Z:Z,\"no\")","v":0},{"$f":"COUNTIF('Aug-Raw'!AB:AB,\"no\")","v":0},{"$f":"COUNTIF('Aug-Raw'!AD:AD,\"no\")","v":0},{"$f":"COUNTIF('Aug-Raw'!AF:AF,\"no\")","v":0},{"$f":"COUNTIF('Aug-Raw'!AH:AH,\"no\")","v":0},{"$f":"COUNTIF('Aug-Raw'!AJ:AJ,\"no\")","v":0},{"$f":"COUNTIF('Aug-Raw'!AL:AL,\"no\")","v":0},{"$f":"COUNTIF('Aug-Raw'!AN:AN,\"no\")","v":0},{"$f":"COUNTIF('Aug-Raw'!AP:AP,\"no\")","v":0},{"$f":"COUNTIF('Aug-Raw'!AR:AR,\"no\")","v":0},{"$f":"COUNTIF('Aug-Raw'!AT:AT,\"no\")","v":0},{"$f":"COUNTIF('Aug-Raw'!AV:AV,\"no\")","v":0},{"$f":"COUNTIF('Aug-Raw'!AX:AX,\"no\")","v":0},{"$f":"COUNTIF('Aug-Raw'!AZ:AZ,\"no\")","v":0},{"$f":"COUNTIF('Aug-Raw'!BB:BB,\"no\")","v":0},{"$f":"COUNTIF('Aug-Raw'!BD:BD,\"no\")","v":0},{"$f":"COUNTIF('Aug-Raw'!BF:BF,\"no\")","v":0},{"$f":"COUNTIF('Aug-Raw'!BH:BH,\"no\")","v":0},{"$f":"COUNTIF('Aug-Raw'!BJ:BJ,\"no\")","v":0},{"$f":"COUNTIF('Aug-Raw'!BL:BL,\"no\")","v":0},{"$f":"COUNTIF('Aug-Raw'!BN:BN,\"no\")","v":0},{"$f":"COUNTIF('Aug-Raw'!BP:BP,\"no\")","v":0},{"$f":"COUNTIF('Aug-Raw'!BR:BR,\"no\")","v":0},{"$f":"COUNTIF('Aug-Raw'!BT:BT,\"no\")","v":0},{"$f":"COUNTIF('Aug-Raw'!BV:BV,\"no\")","v":0},{"$f":"COUNTIF('Aug-Raw'!BX:BX,\"no\")","v":0},{"$f":"COUNTIF('Aug-Raw'!BZ:BZ,\"no\")","v":0},{"$f":"COUNTIF('Aug-Raw'!CB:CB,\"no\")","v":0},{"$f":"COUNTIF('Aug-Raw'!CD:CD,\"no\")","v":0},{"$f":"COUNTIF('Aug-Raw'!CF:CF,\"no\")","v":0},{"$f":"COUNTIF('Aug-Raw'!CH:CH,\"no\")","v":0}]
["Total Justified",{"$f":"COUNTIF('Aug-Raw'!H:H,\"Justified\")","v":0},{"$f":"COUNTIF('Aug-Raw'!J:J,\"Justified\")","v":0},{"$f":"COUNTIF('Aug-Raw'!L:L,\"Justified\")","v":0},{"$f":"COUNTIF('Aug-Raw'!N:N,\"Justified\")","v":0},{"$f":"COUNTIF('Aug-Raw'!P:P,\"Justified\")","v":0},{"$f":"COUNTIF('Aug-Raw'!R:R,\"Justified\")","v":0},{"$f":"COUNTIF('Aug-Raw'!T:T,\"Justified\")","v":0},{"$f":"COUNTIF('Aug-Raw'!V:V,\"Justified\")","v":0},{"$f":"COUNTIF('Aug-Raw'!X:X,\"Justified\")","v":0},{"$f":"COUNTIF('Aug-Raw'!Z:Z,\"Justified\")","v":0},{"$f":"COUNTIF('Aug-Raw'!AB:AB,\"Justified\")","v":0},{"$f":"COUNTIF('Aug-Raw'!AD:AD,\"Justified\")","v":0},{"$f":"COUNTIF('Aug-Raw'!AF:AF,\"Justified\")","v":0},{"$f":"COUNTIF('Aug-Raw'!AH:AH,\"Justified\")","v":0},{"$f":"COUNTIF('Aug-Raw'!AJ:AJ,\"Justified\")","v":0},{"$f":"COUNTIF('Aug-Raw'!AL:AL,\"Justified\")","v":0},{"$f":"COUNTIF('Aug-Raw'!AN:AN,\"Justified\")","v":0},{"$f":"COUNTIF('Aug-Raw'!AP:AP,\"Justified\")","v":0},{"$f":"COUNTIF('Aug-Raw'!AR:AR,\"Justified\")","v":0},{"$f":"COUNTIF('Aug-Raw'!AT:AT,\"Justified\")","v":0},{"$f":"COUNTIF('Aug-Raw'!AV:AV,\"Justified\")","v":0},{"$f":"COUNTIF('Aug-Raw'!AX:AX,\"Justified\")","v":0},{"$f":"COUNTIF('Aug-Raw'!AZ:AZ,\"Justified\")","v":0},{"$f":"COUNTIF('Aug-Raw'!BB:BB,\"Justified\")","v":0},{"$f":"COUNTIF('Aug-Raw'!BD:BD,\"Justified\")","v":0},{"$f":"COUNTIF('Aug-Raw'!BF:BF,\"Justified\")","v":0},{"$f":"COUNTIF('Aug-Raw'!BH:BH,\"Justified\")","v":0},{"$f":"COUNTIF('Aug-Raw'!BJ:BJ,\"Justified\")","v":0},{"$f":"COUNTIF('Aug-Raw'!BL:BL,\"Justified\")","v":0},{"$f":"COUNTIF('Aug-Raw'!BN:BN,\"Justified\")","v":0},{"$f":"COUNTIF('Aug-Raw'!BP:BP,\"Justified\")","v":0},{"$f":"COUNTIF('Aug-Raw'!BR:BR,\"Justified\")","v":0},{"$f":"COUNTIF('Aug-Raw'!BT:BT,\"Justified\")","v":0},{"$f":"COUNTIF('Aug-Raw'!BV:BV,\"Justified\")","v":0},{"$f":"COUNTIF('Aug-Raw'!BX:BX,\"Justified\")","v":0},{"$f":"COUNTIF('Aug-Raw'!BZ:BZ,\"Justified\")","v":0},{"$f":"COUNTIF('Aug-Raw'!CB:CB,\"Justified\")","v":0},{"$f":"COUNTIF('Aug-Raw'!CD:CD,\"Justified\")","v":0},{"$f":"COUNTIF('Aug-Raw'!CF:CF,\"Justified\")","v":0},{"$f":"COUNTIF('Aug-Raw'!CH:CH,\"Justified\")","v":0}]
["Total NA",{"$f":"COUNTIF('Aug-Raw'!H:H,\"NA\")","v":0},{"$f":"COUNTIF('Aug-Raw'!J:J,\"NA\")","v":0},{"$f":"COUNTIF('Aug-Raw'!L:L,\"NA\")","v":0},{"$f":"COUNTIF('Aug-Raw'!N:N,\"NA\")","v":0},{"$f":"COUNTIF('Aug-Raw'!P:P,\"NA\")","v":0},{"$f":"COUNTIF('Aug-Raw'!R:R,\"NA\")","v":0},{"$f":"COUNTIF('Aug-Raw'!T:T,\"NA\")","v":0},{"$f":"COUNTIF('Aug-Raw'!V:V,\"NA\")","v":0},{"$f":"COUNTIF('Aug-Raw'!X:X,\"NA\")","v":0},{"$f":"COUNTIF('Aug-Raw'!Z:Z,\"NA\")","v":0},{"$f":"COUNTIF('Aug-Raw'!AB:AB,\"NA\")","v":0},{"$f":"COUNTIF('Aug-Raw'!AD:AD,\"NA\")","v":0},{"$f":"COUNTIF('Aug-Raw'!AF:AF,\"NA\")","v":0},{"$f":"COUNTIF('Aug-Raw'!AH:AH,\"NA\")","v":0},{"$f":"COUNTIF('Aug-Raw'!AJ:AJ,\"NA\")","v":0},{"$f":"COUNTIF('Aug-Raw'!AL:AL,\"NA\")","v":0},{"$f":"COUNTIF('Aug-Raw'!AN:AN,\"NA\")","v":0},{"$f":"COUNTIF('Aug-Raw'!AP:AP,\"NA\")","v":0},{"$f":"COUNTIF('Aug-Raw'!AR:AR,\"NA\")","v":0},{"$f":"COUNTIF('Aug-Raw'!AT:AT,\"NA\")","v":0},{"$f":"COUNTIF('Aug-Raw'!AV:AV,\"NA\")","v":0},{"$f":"COUNTIF('Aug-Raw'!AX:AX,\"NA\")","v":0},{"$f":"COUNTIF('Aug-Raw'!AZ:AZ,\"NA\")","v":0},{"$f":"COUNTIF('Aug-Raw'!BB:BB,\"NA\")","v":0},{"$f":"COUNTIF('Aug-Raw'!BD:BD,\"NA\")","v":0},{"$f":"COUNTIF('Aug-Raw'!BF:BF,\"NA\")","v":0},{"$f":"COUNTIF('Aug-Raw'!BH:BH,\"NA\")","v":0},{"$f":"COUNTIF('Aug-Raw'!BJ:BJ,\"NA\")","v":0},{"$f":"COUNTIF('Aug-Raw'!BL:BL,\"NA\")","v":0},{"$f":"COUNTIF('Aug-Raw'!BN:BN,\"NA\")","v":0},{"$f":"COUNTIF('Aug-Raw'!BP:BP,\"NA\")","v":0},{"$f":"COUNTIF('Aug-Raw'!BR:BR,\"NA\")","v":0},{"$f":"COUNTIF('Aug-Raw'!BT:BT,\"NA\")","v":0},{"$f":"COUNTIF('Aug-Raw'!BV:BV,\"NA\")","v":0},{"$f":"COUNTIF('Aug-Raw'!BX:BX,\"NA\")","v":0},{"$f":"COUNTIF('Aug-Raw'!BZ:BZ,\"NA\")","v":0},{"$f":"COUNTIF('Aug-Raw'!CB:CB,\"NA\")","v":0},{"$f":"COUNTIF('Aug-Raw'!CD:CD,\"NA\")","v":0},{"$f":"COUNTIF('Aug-Raw'!CF:CF,\"NA\")","v":0},{"$f":"COUNTIF('Aug-Raw'!CH:CH,\"NA\")","v":0}]
["Blanks",{"$f":"B8-(SUM(B3:B6))","v":0},{"$f":"C8-(SUM(C3:C6))","v":0},0,0,0,0,0,0,0,0,0,0,0,0,0,0,0,0,0,0,0,0,0,0,0,0,0,0,0,0,0,0,0,0,0,0,0,0,0,0]
["full sample size",{"$f":"COUNTA('Aug-Raw'!A:A)-2","v":0},{"$f":"B8","v":0},0,0,0,0,0,0,0,0,0,0,0,0,0,0,0,0,0,0,0,0,0,0,0,0,0,0,0,0,0,0,0,0,0,0,0,0,0,0]
["True sample size (-NA + blanks)",{"$f":"IF(ISERROR(B8-(B6+B7)),\"\",B8-(B6+B7))","v":0},{"$f":"IF(ISERROR(C8-(C6+C7)),\"\",C8-(C6+C7))","v":0},0,0,0,0,0,0,0,0,0,0,0,0,0,0,0,0,0,0,0,0,0,0,0,0,0,0,0,0,0,0,0,0,0,0,0,0,0,0]
["%Y",{"$f":"IF(ISERROR(B3/B9),\"\",B3/B9)","v":""},{"$f":"IF(ISERROR(C3/C9),\"\",C3/C9)","v":""},"","","","","","","","","","","","","","","","","","","","","","","","","","","","","","","","","","","","","",""]
["%N",{"$f":"IF(ISERROR(B4/B9),\"\",B4/B9)","v":""},{"$f":"IF(ISERROR(C4/C9),\"\",C4/C9)","v":""},"","","","","","","","","","","","","","","","","","","","","","","","","","","","","","","","","","","","","",""]
["%N - Justified",{"$f":"IF(ISERROR(B5/B9),\"\",B5/B9)","v":""},{"$f":"IF(ISERROR(C5/C9),\"\",C5/C9)","v":""},"","","","","","","","","","","","","","","","","","","","","","","","","","","","","","","","","","","","","",""]

{"sheet":"Sept","index":21,"n_rows":51,"n_cols":8,"rows_kept":51,"cut":false,"hidden":false,"merged":[]}
["Click here to go to year overview"]
[]
["Date",null,null,"Total by Apt type"]
["Completed by",null,null,"New",{"$f":"COUNTIF('Sept-Raw'!E3:E103,\"New\")","v":0}]
["Sample group size",{"$f":"COUNTA('Sept-Raw'!A:A)-2","v":0},null,"Follow up",{"$f":"COUNTIF('Sept-Raw'!E3:E103,\"Fup\")","v":0},null,null,{"$f":"Year!H5","v":0.95}]
["Overall Result (compliant only)",{"$f":"IF(ISERROR(SUM(C11:C50)/G51),\"\",SUM(C11:C50)/G51)","v":""},null,"Total by apt Code",null,null,null,{"$f":"Year!H6","v":"80-95%"}]
["Overall Result (compliant & Justified)",{"$f":"IF(ISERROR(SUM(B11:B50)/G51),\"\",SUM(B11:B50)/G51)","v":""},null,"code goes in here",{"$f":"COUNTIF('Sept-Raw'!F3:F103,D7)","v":0},null,null,{"$f":"Year!H7","v":0.8}]
["viable qs",{"$f":"G51","v":0}]
[]
["Metric","Compliant + Justified","Compliant","Justified","Not compliant","Irritating math"]
[{"$f":"IF(ISERROR('Audit questions'!A2),\"\",'Audit questions'!A2)","v":"Test1"},{"$f":"IF(ISERROR(C11+D11),\"\",C11+D11)","v":""},{"$f":"'Sept-Data'!B10","v":""},{"$f":"'Sept-Data'!B12","v":""},{"$f":"'Sept-Data'!B11","v":""},{"$f":"COUNTIF(C11:E11,\">0\")","v":0}]
[{"$f":"IF(ISERROR('Audit questions'!A3),\"\",'Audit questions'!A3)","v":"Test2"},"",{"$f":"'Sept-Data'!C10","v":""},{"$f":"'Sept-Data'!C12","v":""},{"$f":"'Sept-Data'!C11","v":""},0]
[{"$f":"IF(ISERROR('Audit questions'!A4),\"\",'Audit questions'!A4)","v":"Test3"},"",{"$f":"'Sept-Data'!D10","v":""},{"$f":"'Sept-Data'!D12","v":""},{"$f":"'Sept-Data'!D11","v":""},0]
[{"$f":"IF(ISERROR('Audit questions'!A5),\"\",'Audit questions'!A5)","v":"Test4"},"",{"$f":"'Sept-Data'!E10","v":""},{"$f":"'Sept-Data'!E12","v":""},{"$f":"'Sept-Data'!E11","v":""},0]
[{"$f":"IF(ISERROR('Audit questions'!A6),\"\",'Audit questions'!A6)","v":"Test5"},"",{"$f":"'Sept-Data'!F10","v":""},{"$f":"'Sept-Data'!F12","v":""},{"$f":"'Sept-Data'!F11","v":""},0]
[{"$f":"IF(ISERROR('Audit questions'!A7),\"\",'Audit questions'!A7)","v":"Test6"},"",{"$f":"'Sept-Data'!G10","v":""},{"$f":"'Sept-Data'!G12","v":""},{"$f":"'Sept-Data'!G11","v":""},0]
[{"$f":"IF(ISERROR('Audit questions'!A8),\"\",'Audit questions'!A8)","v":"Test7"},"",{"$f":"'Sept-Data'!H10","v":""},{"$f":"'Sept-Data'!H12","v":""},{"$f":"'Sept-Data'!H11","v":""},0]
[{"$f":"IF(ISERROR('Audit questions'!A9),\"\",'Audit questions'!A9)","v":"Test8"},"",{"$f":"'Sept-Data'!I10","v":""},{"$f":"'Sept-Data'!I12","v":""},{"$f":"'Sept-Data'!I11","v":""},0]
[{"$f":"IF(ISERROR('Audit questions'!A10),\"\",'Audit questions'!A10)","v":"Test9"},"",{"$f":"'Sept-Data'!J10","v":""},{"$f":"'Sept-Data'!J12","v":""},{"$f":"'Sept-Data'!J11","v":""},0]
[{"$f":"IF(ISERROR('Audit questions'!A11),\"\",'Audit questions'!A11)","v":"Test10"},"",{"$f":"'Sept-Data'!K10","v":""},{"$f":"'Sept-Data'!K12","v":""},{"$f":"'Sept-Data'!K11","v":""},0]
[{"$f":"IF(ISERROR('Audit questions'!A12),\"\",'Audit questions'!A12)","v":"Test11"},"",{"$f":"'Sept-Data'!L10","v":""},{"$f":"'Sept-Data'!L12","v":""},{"$f":"'Sept-Data'!L11","v":""},0]
[{"$f":"IF(ISERROR('Audit questions'!A13),\"\",'Audit questions'!A13)","v":"Test12"},"",{"$f":"'Sept-Data'!M10","v":""},{"$f":"'Sept-Data'!M12","v":""},{"$f":"'Sept-Data'!M11","v":""},0]
[{"$f":"IF(ISERROR('Audit questions'!A14),\"\",'Audit questions'!A14)","v":"Test13"},"",{"$f":"'Sept-Data'!N10","v":""},{"$f":"'Sept-Data'!N12","v":""},{"$f":"'Sept-Data'!N11","v":""},0]
[{"$f":"IF(ISERROR('Audit questions'!A15),\"\",'Audit questions'!A15)","v":"Test14"},"",{"$f":"'Sept-Data'!O10","v":""},{"$f":"'Sept-Data'!O12","v":""},{"$f":"'Sept-Data'!O11","v":""},0]
[{"$f":"IF(ISERROR('Audit questions'!A16),\"\",'Audit questions'!A16)","v":"Test15"},"",{"$f":"'Sept-Data'!P10","v":""},{"$f":"'Sept-Data'!P12","v":""},{"$f":"'Sept-Data'!P11","v":""},0]
[{"$f":"IF(ISERROR('Audit questions'!A17),\"\",'Audit questions'!A17)","v":"Test16"},"",{"$f":"'Sept-Data'!Q10","v":""},{"$f":"'Sept-Data'!Q12","v":""},{"$f":"'Sept-Data'!Q11","v":""},0]
[{"$f":"IF(ISERROR('Audit questions'!A18),\"\",'Audit questions'!A18)","v":"Test17"},"",{"$f":"'Sept-Data'!R10","v":""},{"$f":"'Sept-Data'!R12","v":""},{"$f":"'Sept-Data'!R11","v":""},0]
[{"$f":"IF(ISERROR('Audit questions'!A19),\"\",'Audit questions'!A19)","v":"Test18"},"",{"$f":"'Sept-Data'!S10","v":""},{"$f":"'Sept-Data'!S12","v":""},{"$f":"'Sept-Data'!S11","v":""},0]
[{"$f":"IF(ISERROR('Audit questions'!A20),\"\",'Audit questions'!A20)","v":"Test19"},"",{"$f":"'Sept-Data'!T10","v":""},{"$f":"'Sept-Data'!T12","v":""},{"$f":"'Sept-Data'!T11","v":""},0]
[{"$f":"IF(ISERROR('Audit questions'!A21),\"\",'Audit questions'!A21)","v":"Test20"},"",{"$f":"'Sept-Data'!U10","v":""},{"$f":"'Sept-Data'!U12","v":""},{"$f":"'Sept-Data'!U11","v":""},0]
[{"$f":"IF(ISERROR('Audit questions'!A22),\"\",'Audit questions'!A22)","v":"Test21"},"",{"$f":"'Sept-Data'!V10","v":""},{"$f":"'Sept-Data'!V12","v":""},{"$f":"'Sept-Data'!V11","v":""},0]
[{"$f":"IF(ISERROR('Audit questions'!A23),\"\",'Audit questions'!A23)","v":"Test22"},"",{"$f":"'Sept-Data'!W10","v":""},{"$f":"'Sept-Data'!W12","v":""},{"$f":"'Sept-Data'!W11","v":""},0]
[{"$f":"IF(ISERROR('Audit questions'!A24),\"\",'Audit questions'!A24)","v":"Test23"},"",{"$f":"'Sept-Data'!X10","v":""},{"$f":"'Sept-Data'!X12","v":""},{"$f":"'Sept-Data'!X11","v":""},0]
[{"$f":"IF(ISERROR('Audit questions'!A25),\"\",'Audit questions'!A25)","v":"Test24"},"",{"$f":"'Sept-Data'!Y10","v":""},{"$f":"'Sept-Data'!Y12","v":""},{"$f":"'Sept-Data'!Y11","v":""},0]
[{"$f":"IF(ISERROR('Audit questions'!A26),\"\",'Audit questions'!A26)","v":"Test25"},"",{"$f":"'Sept-Data'!Z10","v":""},{"$f":"'Sept-Data'!Z12","v":""},{"$f":"'Sept-Data'!Z11","v":""},0]
[{"$f":"IF(ISERROR('Audit questions'!A27),\"\",'Audit questions'!A27)","v":"Test26"},"",{"$f":"'Sept-Data'!AA10","v":""},{"$f":"'Sept-Data'!AA12","v":""},{"$f":"'Sept-Data'!AA11","v":""},0]
[{"$f":"IF(ISERROR('Audit questions'!A28),\"\",'Audit questions'!A28)","v":"Test27"},"",{"$f":"'Sept-Data'!AB10","v":""},{"$f":"'Sept-Data'!AB12","v":""},{"$f":"'Sept-Data'!AB11","v":""},0]
[{"$f":"IF(ISERROR('Audit questions'!A29),\"\",'Audit questions'!A29)","v":"Test28"},"",{"$f":"'Sept-Data'!AC10","v":""},{"$f":"'Sept-Data'!AC12","v":""},{"$f":"'Sept-Data'!AC11","v":""},0]
[{"$f":"IF(ISERROR('Audit questions'!A30),\"\",'Audit questions'!A30)","v":"Test29"},"",{"$f":"'Sept-Data'!AD10","v":""},{"$f":"'Sept-Data'!AD12","v":""},{"$f":"'Sept-Data'!AD11","v":""},0]
[{"$f":"IF(ISERROR('Audit questions'!A31),\"\",'Audit questions'!A31)","v":"Test30"},"",{"$f":"'Sept-Data'!AE10","v":""},{"$f":"'Sept-Data'!AE12","v":""},{"$f":"'Sept-Data'!AE11","v":""},0]
[{"$f":"IF(ISERROR('Audit questions'!A32),\"\",'Audit questions'!A32)","v":"Test31"},"",{"$f":"'Sept-Data'!AF10","v":""},{"$f":"'Sept-Data'!AF12","v":""},{"$f":"'Sept-Data'!AF11","v":""},0]
[{"$f":"IF(ISERROR('Audit questions'!A33),\"\",'Audit questions'!A33)","v":"Test32"},"",{"$f":"'Sept-Data'!AG10","v":""},{"$f":"'Sept-Data'!AG12","v":""},{"$f":"'Sept-Data'!AG11","v":""},0]
[{"$f":"IF(ISERROR('Audit questions'!A34),\"\",'Audit questions'!A34)","v":"Test33"},"",{"$f":"'Sept-Data'!AH10","v":""},{"$f":"'Sept-Data'!AH12","v":""},{"$f":"'Sept-Data'!AH11","v":""},0]
[{"$f":"IF(ISERROR('Audit questions'!A35),\"\",'Audit questions'!A35)","v":"Test34"},"",{"$f":"'Sept-Data'!AI10","v":""},{"$f":"'Sept-Data'!AI12","v":""},{"$f":"'Sept-Data'!AI11","v":""},0]
[{"$f":"IF(ISERROR('Audit questions'!A36),\"\",'Audit questions'!A36)","v":"Test35"},"",{"$f":"'Sept-Data'!AJ10","v":""},{"$f":"'Sept-Data'!AJ12","v":""},{"$f":"'Sept-Data'!AJ11","v":""},0]
[{"$f":"IF(ISERROR('Audit questions'!A37),\"\",'Audit questions'!A37)","v":"Test36"},"",{"$f":"'Sept-Data'!AK10","v":""},{"$f":"'Sept-Data'!AK12","v":""},{"$f":"'Sept-Data'!AK11","v":""},0]
[{"$f":"IF(ISERROR('Audit questions'!A38),\"\",'Audit questions'!A38)","v":"Test37"},"",{"$f":"'Sept-Data'!AL10","v":""},{"$f":"'Sept-Data'!AL12","v":""},{"$f":"'Sept-Data'!AL11","v":""},0]
[{"$f":"IF(ISERROR('Audit questions'!A39),\"\",'Audit questions'!A39)","v":"Test38"},"",{"$f":"'Sept-Data'!AM10","v":""},{"$f":"'Sept-Data'!AM12","v":""},{"$f":"'Sept-Data'!AM11","v":""},0]
[{"$f":"IF(ISERROR('Audit questions'!A40),\"\",'Audit questions'!A40)","v":"Test39"},"",{"$f":"'Sept-Data'!AN10","v":""},{"$f":"'Sept-Data'!AN12","v":""},{"$f":"'Sept-Data'!AN11","v":""},0]
[{"$f":"IF(ISERROR('Audit questions'!A41),\"\",'Audit questions'!A41)","v":"Test40"},"",{"$f":"'Sept-Data'!AO10","v":""},{"$f":"'Sept-Data'!AO12","v":""},{"$f":"'Sept-Data'!AO11","v":""},0]
[null,null,null,null,null,null,{"$f":"COUNTIF(F11:F50,\">=1\")","v":0}]

{"sheet":"Sept-Raw","index":22,"n_rows":2,"n_cols":87,"rows_kept":2,"cut":false,"hidden":true,"merged":[[0,85,0,86],[0,63,0,64],[0,65,0,66],[0,67,0,68],[0,69,0,70],[0,71,0,72],[0,73,0,74],[0,75,0,76],[0,77,0,78],[0,79,0,80],[0,81,0,82],[0,83,0,84],[0,61,0,62],[0,39,0,40],[0,41,0,42],[0,43,0,44],[0,45,0,46],[0,47,0,48],[0,49,0,50],[0,51,0,52],[0,53,0,54],[0,55,0,56],[0,57,0,58],[0,59,0,60],[0,37,0,38],[0,15,0,16],[0,17,0,18],[0,19,0,20],[0,21,0,22],[0,23,0,24],[0,25,0,26],[0,27,0,28],[0,29,0,30],[0,31,0,32],[0,33,0,34],[0,35,0,36],[0,13,0,14],[0,0,0,5],[0,6,1,6],[0,7,0,8],[0,9,0,10],[0,11,0,12]]}
["Record details",null,null,null,null,null,"Notes",{"$f":"'Audit questions'!A2","v":"Test1"},null,{"$f":"'Audit questions'!A3","v":"Test2"},null,{"$f":"'Audit questions'!A4","v":"Test3"},null,{"$f":"'Audit questions'!A5","v":"Test4"},null,{"$f":"'Audit questions'!A6","v":"Test5"},null,{"$f":"'Audit questions'!A7","v":"Test6"},null,{"$f":"'Audit questions'!A8","v":"Test7"},null,{"$f":"'Audit questions'!A9","v":"Test8"},null,{"$f":"'Audit questions'!A10","v":"Test9"},null,{"$f":"'Audit questions'!A11","v":"Test10"},null,{"$f":"'Audit questions'!A12","v":"Test11"},null,{"$f":"'Audit questions'!A13","v":"Test12"},null,{"$f":"'Audit questions'!A14","v":"Test13"},null,{"$f":"'Audit questions'!A15","v":"Test14"},null,{"$f":"'Audit questions'!A16","v":"Test15"},null,{"$f":"'Audit questions'!A17","v":"Test16"},null,{"$f":"'Audit questions'!A18","v":"Test17"},null,{"$f":"'Audit questions'!A19","v":"Test18"},null,{"$f":"'Audit questions'!A20","v":"Test19"},null,{"$f":"'Audit questions'!A21","v":"Test20"},null,{"$f":"'Audit questions'!A22","v":"Test21"},null,{"$f":"'Audit questions'!A23","v":"Test22"},null,{"$f":"'Audit questions'!A24","v":"Test23"},null,{"$f":"'Audit questions'!A25","v":"Test24"},null,{"$f":"'Audit questions'!A26","v":"Test25"},null,{"$f":"'Audit questions'!A27","v":"Test26"},null,{"$f":"'Audit questions'!A28","v":"Test27"},null,{"$f":"'Audit questions'!A29","v":"Test28"},null,{"$f":"'Audit questions'!A30","v":"Test29"},null,{"$f":"'Audit questions'!A31","v":"Test30"},null,{"$f":"'Audit questions'!A32","v":"Test31"},null,{"$f":"'Audit questions'!A33","v":"Test32"},null,{"$f":"'Audit questions'!A34","v":"Test33"},null,{"$f":"'Audit questions'!A35","v":"Test34"},null,{"$f":"'Audit questions'!A36","v":"Test35"},null,{"$f":"'Audit questions'!A37","v":"Test36"},null,{"$f":"'Audit questions'!A38","v":"Test37"},null,{"$f":"'Audit questions'!A39","v":"Test38"},null,{"$f":"'Audit questions'!A40","v":"Test39"},null,{"$f":"'Audit questions'!A41","v":"Test40"}]
["Pt number","Date seen","Clinician 1","clinician 2","New/ F-up","Apt code",null,"Compliant?","Other result","Compliant?","Other result","Compliant?","Other result","Compliant?","Other result","Compliant?","Other result","Compliant?","Other result","Compliant?","Other result","Compliant?","Other result","Compliant?","Other result","Compliant?","Other result","Compliant?","Other result","Compliant?","Other result","Compliant?","Other result","Compliant?","Other result","Compliant?","Other result","Compliant?","Other result","Compliant?","Other result","Compliant?","Other result","Compliant?","Other result","Compliant?","Other result","Compliant?","Other result","Compliant?","Other result","Compliant?","Other result","Compliant?","Other result","Compliant?","Other result","Compliant?","Other result","Compliant?","Other result","Compliant?","Other result","Compliant?","Other result","Compliant?","Other result","Compliant?","Other result","Compliant?","Other result","Compliant?","Other result","Compliant?","Other result","Compliant?","Other result","Compliant?","Other result","Compliant?","Other result","Compliant?","Other result","Compliant?","Other result","Compliant?","Other result"]

{"sheet":"Sept-Data","index":23,"n_rows":12,"n_cols":41,"rows_kept":12,"cut":false,"hidden":true,"merged":[[0,0,1,0]]}
["Results",{"$f":"'Audit questions'!A2","v":"Test1"},{"$f":"'Audit questions'!A3","v":"Test2"},{"$f":"'Audit questions'!A4","v":"Test3"},{"$f":"'Audit questions'!A5","v":"Test4"},{"$f":"'Audit questions'!A6","v":"Test5"},{"$f":"'Audit questions'!A7","v":"Test6"},{"$f":"'Audit questions'!A8","v":"Test7"},{"$f":"'Audit questions'!A9","v":"Test8"},{"$f":"'Audit questions'!A10","v":"Test9"},{"$f":"'Audit questions'!A11","v":"Test10"},{"$f":"'Audit questions'!A12","v":"Test11"},{"$f":"'Audit questions'!A13","v":"Test12"},{"$f":"'Audit questions'!A14","v":"Test13"},{"$f":"'Audit questions'!A15","v":"Test14"},{"$f":"'Audit questions'!A16","v":"Test15"},{"$f":"'Audit questions'!A17","v":"Test16"},{"$f":"'Audit questions'!A18","v":"Test17"},{"$f":"'Audit questions'!A19","v":"Test18"},{"$f":"'Audit questions'!A20","v":"Test19"},{"$f":"'Audit questions'!A21","v":"Test20"},{"$f":"'Audit questions'!A22","v":"Test21"},{"$f":"'Audit questions'!A23","v":"Test22"},{"$f":"'Audit questions'!A24","v":"Test23"},{"$f":"'Audit questions'!A25","v":"Test24"},{"$f":"'Audit questions'!A26","v":"Test25"},{"$f":"'Audit questions'!A27","v":"Test26"},{"$f":"'Audit questions'!A28","v":"Test27"},{"$f":"'Audit questions'!A29","v":"Test28"},{"$f":"'Audit questions'!A30","v":"Test29"},{"$f":"'Audit questions'!A31","v":"Test30"},{"$f":"'Audit questions'!A32","v":"Test31"},{"$f":"'Audit questions'!A33","v":"Test32"},{"$f":"'Audit questions'!A34","v":"Test33"},{"$f":"'Audit questions'!A35","v":"Test34"},{"$f":"'Audit questions'!A36","v":"Test35"},{"$f":"'Audit questions'!A37","v":"Test36"},{"$f":"'Audit questions'!A38","v":"Test37"},{"$f":"'Audit questions'!A39","v":"Test38"},{"$f":"'Audit questions'!A40","v":"Test39"},{"$f":"'Audit questions'!A41","v":"Test40"}]
[null,"Compliant?","Compliant?","Compliant?","Compliant?","Compliant?","Compliant?","Compliant?","Compliant?","Compliant?","Compliant?","Compliant?","Compliant?","Compliant?","Compliant?","Compliant?","Compliant?","Compliant?","Compliant?","Compliant?","Compliant?","Compliant?","Compliant?","Compliant?","Compliant?","Compliant?","Compliant?","Compliant?","Compliant?","Compliant?","Compliant?","Compliant?","Compliant?","Compliant?","Compliant?","Compliant?","Compliant?","Compliant?","Compliant?","Compliant?","Compliant?"]
["Total Y",{"$f":"COUNTIF('Sept-Raw'!H:H,\"yes\")","v":0},{"$f":"COUNTIF('Sept-Raw'!J:J,\"yes\")","v":0},{"$f":"COUNTIF('Sept-Raw'!L:L,\"yes\")","v":0},{"$f":"COUNTIF('Sept-Raw'!N:N,\"yes\")","v":0},{"$f":"COUNTIF('Sept-Raw'!P:P,\"yes\")","v":0},{"$f":"COUNTIF('Sept-Raw'!R:R,\"yes\")","v":0},{"$f":"COUNTIF('Sept-Raw'!T:T,\"yes\")","v":0},{"$f":"COUNTIF('Sept-Raw'!V:V,\"yes\")","v":0},{"$f":"COUNTIF('Sept-Raw'!X:X,\"yes\")","v":0},{"$f":"COUNTIF('Sept-Raw'!Z:Z,\"yes\")","v":0},{"$f":"COUNTIF('Sept-Raw'!AB:AB,\"yes\")","v":0},{"$f":"COUNTIF('Sept-Raw'!AD:AD,\"yes\")","v":0},{"$f":"COUNTIF('Sept-Raw'!AF:AF,\"yes\")","v":0},{"$f":"COUNTIF('Sept-Raw'!AH:AH,\"yes\")","v":0},{"$f":"COUNTIF('Sept-Raw'!AJ:AJ,\"yes\")","v":0},{"$f":"COUNTIF('Sept-Raw'!AL:AL,\"yes\")","v":0},{"$f":"COUNTIF('Sept-Raw'!AN:AN,\"yes\")","v":0},{"$f":"COUNTIF('Sept-Raw'!AP:AP,\"yes\")","v":0},{"$f":"COUNTIF('Sept-Raw'!AR:AR,\"yes\")","v":0},{"$f":"COUNTIF('Sept-Raw'!AT:AT,\"yes\")","v":0},{"$f":"COUNTIF('Sept-Raw'!AV:AV,\"yes\")","v":0},{"$f":"COUNTIF('Sept-Raw'!AX:AX,\"yes\")","v":0},{"$f":"COUNTIF('Sept-Raw'!AZ:AZ,\"yes\")","v":0},{"$f":"COUNTIF('Sept-Raw'!BB:BB,\"yes\")","v":0},{"$f":"COUNTIF('Sept-Raw'!BD:BD,\"yes\")","v":0},{"$f":"COUNTIF('Sept-Raw'!BF:BF,\"yes\")","v":0},{"$f":"COUNTIF('Sept-Raw'!BH:BH,\"yes\")","v":0},{"$f":"COUNTIF('Sept-Raw'!BJ:BJ,\"yes\")","v":0},{"$f":"COUNTIF('Sept-Raw'!BL:BL,\"yes\")","v":0},{"$f":"COUNTIF('Sept-Raw'!BN:BN,\"yes\")","v":0},{"$f":"COUNTIF('Sept-Raw'!BP:BP,\"yes\")","v":0},{"$f":"COUNTIF('Sept-Raw'!BR:BR,\"yes\")","v":0},{"$f":"COUNTIF('Sept-Raw'!BT:BT,\"yes\")","v":0},{"$f":"COUNTIF('Sept-Raw'!BV:BV,\"yes\")","v":0},{"$f":"COUNTIF('Sept-Raw'!BX:BX,\"yes\")","v":0},{"$f":"COUNTIF('Sept-Raw'!BZ:BZ,\"yes\")","v":0},{"$f":"COUNTIF('Sept-Raw'!CB:CB,\"yes\")","v":0},{"$f":"COUNTIF('Sept-Raw'!CD:CD,\"yes\")","v":0},{"$f":"COUNTIF('Sept-Raw'!CF:CF,\"yes\")","v":0},{"$f":"COUNTIF('Sept-Raw'!CH:CH,\"yes\")","v":0}]
["Total N",{"$f":"COUNTIF('Sept-Raw'!H:H,\"no\")","v":0},{"$f":"COUNTIF('Sept-Raw'!J:J,\"no\")","v":0},{"$f":"COUNTIF('Sept-Raw'!L:L,\"no\")","v":0},{"$f":"COUNTIF('Sept-Raw'!N:N,\"no\")","v":0},{"$f":"COUNTIF('Sept-Raw'!P:P,\"no\")","v":0},{"$f":"COUNTIF('Sept-Raw'!R:R,\"no\")","v":0},{"$f":"COUNTIF('Sept-Raw'!T:T,\"no\")","v":0},{"$f":"COUNTIF('Sept-Raw'!V:V,\"no\")","v":0},{"$f":"COUNTIF('Sept-Raw'!X:X,\"no\")","v":0},{"$f":"COUNTIF('Sept-Raw'!Z:Z,\"no\")","v":0},{"$f":"COUNTIF('Sept-Raw'!AB:AB,\"no\")","v":0},{"$f":"COUNTIF('Sept-Raw'!AD:AD,\"no\")","v":0},{"$f":"COUNTIF('Sept-Raw'!AF:AF,\"no\")","v":0},{"$f":"COUNTIF('Sept-Raw'!AH:AH,\"no\")","v":0},{"$f":"COUNTIF('Sept-Raw'!AJ:AJ,\"no\")","v":0},{"$f":"COUNTIF('Sept-Raw'!AL:AL,\"no\")","v":0},{"$f":"COUNTIF('Sept-Raw'!AN:AN,\"no\")","v":0},{"$f":"COUNTIF('Sept-Raw'!AP:AP,\"no\")","v":0},{"$f":"COUNTIF('Sept-Raw'!AR:AR,\"no\")","v":0},{"$f":"COUNTIF('Sept-Raw'!AT:AT,\"no\")","v":0},{"$f":"COUNTIF('Sept-Raw'!AV:AV,\"no\")","v":0},{"$f":"COUNTIF('Sept-Raw'!AX:AX,\"no\")","v":0},{"$f":"COUNTIF('Sept-Raw'!AZ:AZ,\"no\")","v":0},{"$f":"COUNTIF('Sept-Raw'!BB:BB,\"no\")","v":0},{"$f":"COUNTIF('Sept-Raw'!BD:BD,\"no\")","v":0},{"$f":"COUNTIF('Sept-Raw'!BF:BF,\"no\")","v":0},{"$f":"COUNTIF('Sept-Raw'!BH:BH,\"no\")","v":0},{"$f":"COUNTIF('Sept-Raw'!BJ:BJ,\"no\")","v":0},{"$f":"COUNTIF('Sept-Raw'!BL:BL,\"no\")","v":0},{"$f":"COUNTIF('Sept-Raw'!BN:BN,\"no\")","v":0},{"$f":"COUNTIF('Sept-Raw'!BP:BP,\"no\")","v":0},{"$f":"COUNTIF('Sept-Raw'!BR:BR,\"no\")","v":0},{"$f":"COUNTIF('Sept-Raw'!BT:BT,\"no\")","v":0},{"$f":"COUNTIF('Sept-Raw'!BV:BV,\"no\")","v":0},{"$f":"COUNTIF('Sept-Raw'!BX:BX,\"no\")","v":0},{"$f":"COUNTIF('Sept-Raw'!BZ:BZ,\"no\")","v":0},{"$f":"COUNTIF('Sept-Raw'!CB:CB,\"no\")","v":0},{"$f":"COUNTIF('Sept-Raw'!CD:CD,\"no\")","v":0},{"$f":"COUNTIF('Sept-Raw'!CF:CF,\"no\")","v":0},{"$f":"COUNTIF('Sept-Raw'!CH:CH,\"no\")","v":0}]
["Total Justified",{"$f":"COUNTIF('Sept-Raw'!H:H,\"Justified\")","v":0},{"$f":"COUNTIF('Sept-Raw'!J:J,\"Justified\")","v":0},{"$f":"COUNTIF('Sept-Raw'!L:L,\"Justified\")","v":0},{"$f":"COUNTIF('Sept-Raw'!N:N,\"Justified\")","v":0},{"$f":"COUNTIF('Sept-Raw'!P:P,\"Justified\")","v":0},{"$f":"COUNTIF('Sept-Raw'!R:R,\"Justified\")","v":0},{"$f":"COUNTIF('Sept-Raw'!T:T,\"Justified\")","v":0},{"$f":"COUNTIF('Sept-Raw'!V:V,\"Justified\")","v":0},{"$f":"COUNTIF('Sept-Raw'!X:X,\"Justified\")","v":0},{"$f":"COUNTIF('Sept-Raw'!Z:Z,\"Justified\")","v":0},{"$f":"COUNTIF('Sept-Raw'!AB:AB,\"Justified\")","v":0},{"$f":"COUNTIF('Sept-Raw'!AD:AD,\"Justified\")","v":0},{"$f":"COUNTIF('Sept-Raw'!AF:AF,\"Justified\")","v":0},{"$f":"COUNTIF('Sept-Raw'!AH:AH,\"Justified\")","v":0},{"$f":"COUNTIF('Sept-Raw'!AJ:AJ,\"Justified\")","v":0},{"$f":"COUNTIF('Sept-Raw'!AL:AL,\"Justified\")","v":0},{"$f":"COUNTIF('Sept-Raw'!AN:AN,\"Justified\")","v":0},{"$f":"COUNTIF('Sept-Raw'!AP:AP,\"Justified\")","v":0},{"$f":"COUNTIF('Sept-Raw'!AR:AR,\"Justified\")","v":0},{"$f":"COUNTIF('Sept-Raw'!AT:AT,\"Justified\")","v":0},{"$f":"COUNTIF('Sept-Raw'!AV:AV,\"Justified\")","v":0},{"$f":"COUNTIF('Sept-Raw'!AX:AX,\"Justified\")","v":0},{"$f":"COUNTIF('Sept-Raw'!AZ:AZ,\"Justified\")","v":0},{"$f":"COUNTIF('Sept-Raw'!BB:BB,\"Justified\")","v":0},{"$f":"COUNTIF('Sept-Raw'!BD:BD,\"Justified\")","v":0},{"$f":"COUNTIF('Sept-Raw'!BF:BF,\"Justified\")","v":0},{"$f":"COUNTIF('Sept-Raw'!BH:BH,\"Justified\")","v":0},{"$f":"COUNTIF('Sept-Raw'!BJ:BJ,\"Justified\")","v":0},{"$f":"COUNTIF('Sept-Raw'!BL:BL,\"Justified\")","v":0},{"$f":"COUNTIF('Sept-Raw'!BN:BN,\"Justified\")","v":0},{"$f":"COUNTIF('Sept-Raw'!BP:BP,\"Justified\")","v":0},{"$f":"COUNTIF('Sept-Raw'!BR:BR,\"Justified\")","v":0},{"$f":"COUNTIF('Sept-Raw'!BT:BT,\"Justified\")","v":0},{"$f":"COUNTIF('Sept-Raw'!BV:BV,\"Justified\")","v":0},{"$f":"COUNTIF('Sept-Raw'!BX:BX,\"Justified\")","v":0},{"$f":"COUNTIF('Sept-Raw'!BZ:BZ,\"Justified\")","v":0},{"$f":"COUNTIF('Sept-Raw'!CB:CB,\"Justified\")","v":0},{"$f":"COUNTIF('Sept-Raw'!CD:CD,\"Justified\")","v":0},{"$f":"COUNTIF('Sept-Raw'!CF:CF,\"Justified\")","v":0},{"$f":"COUNTIF('Sept-Raw'!CH:CH,\"Justified\")","v":0}]
["Total NA",{"$f":"COUNTIF('Sept-Raw'!H:H,\"NA\")","v":0},{"$f":"COUNTIF('Sept-Raw'!J:J,\"NA\")","v":0},{"$f":"COUNTIF('Sept-Raw'!L:L,\"NA\")","v":0},{"$f":"COUNTIF('Sept-Raw'!N:N,\"NA\")","v":0},{"$f":"COUNTIF('Sept-Raw'!P:P,\"NA\")","v":0},{"$f":"COUNTIF('Sept-Raw'!R:R,\"NA\")","v":0},{"$f":"COUNTIF('Sept-Raw'!T:T,\"NA\")","v":0},{"$f":"COUNTIF('Sept-Raw'!V:V,\"NA\")","v":0},{"$f":"COUNTIF('Sept-Raw'!X:X,\"NA\")","v":0},{"$f":"COUNTIF('Sept-Raw'!Z:Z,\"NA\")","v":0},{"$f":"COUNTIF('Sept-Raw'!AB:AB,\"NA\")","v":0},{"$f":"COUNTIF('Sept-Raw'!AD:AD,\"NA\")","v":0},{"$f":"COUNTIF('Sept-Raw'!AF:AF,\"NA\")","v":0},{"$f":"COUNTIF('Sept-Raw'!AH:AH,\"NA\")","v":0},{"$f":"COUNTIF('Sept-Raw'!AJ:AJ,\"NA\")","v":0},{"$f":"COUNTIF('Sept-Raw'!AL:AL,\"NA\")","v":0},{"$f":"COUNTIF('Sept-Raw'!AN:AN,\"NA\")","v":0},{"$f":"COUNTIF('Sept-Raw'!AP:AP,\"NA\")","v":0},{"$f":"COUNTIF('Sept-Raw'!AR:AR,\"NA\")","v":0},{"$f":"COUNTIF('Sept-Raw'!AT:AT,\"NA\")","v":0},{"$f":"COUNTIF('Sept-Raw'!AV:AV,\"NA\")","v":0},{"$f":"COUNTIF('Sept-Raw'!AX:AX,\"NA\")","v":0},{"$f":"COUNTIF('Sept-Raw'!AZ:AZ,\"NA\")","v":0},{"$f":"COUNTIF('Sept-Raw'!BB:BB,\"NA\")","v":0},{"$f":"COUNTIF('Sept-Raw'!BD:BD,\"NA\")","v":0},{"$f":"COUNTIF('Sept-Raw'!BF:BF,\"NA\")","v":0},{"$f":"COUNTIF('Sept-Raw'!BH:BH,\"NA\")","v":0},{"$f":"COUNTIF('Sept-Raw'!BJ:BJ,\"NA\")","v":0},{"$f":"COUNTIF('Sept-Raw'!BL:BL,\"NA\")","v":0},{"$f":"COUNTIF('Sept-Raw'!BN:BN,\"NA\")","v":0},{"$f":"COUNTIF('Sept-Raw'!BP:BP,\"NA\")","v":0},{"$f":"COUNTIF('Sept-Raw'!BR:BR,\"NA\")","v":0},{"$f":"COUNTIF('Sept-Raw'!BT:BT,\"NA\")","v":0},{"$f":"COUNTIF('Sept-Raw'!BV:BV,\"NA\")","v":0},{"$f":"COUNTIF('Sept-Raw'!BX:BX,\"NA\")","v":0},{"$f":"COUNTIF('Sept-Raw'!BZ:BZ,\"NA\")","v":0},{"$f":"COUNTIF('Sept-Raw'!CB:CB,\"NA\")","v":0},{"$f":"COUNTIF('Sept-Raw'!CD:CD,\"NA\")","v":0},{"$f":"COUNTIF('Sept-Raw'!CF:CF,\"NA\")","v":0},{"$f":"COUNTIF('Sept-Raw'!CH:CH,\"NA\")","v":0}]
["Blanks",{"$f":"B8-(SUM(B3:B6))","v":0},{"$f":"C8-(SUM(C3:C6))","v":0},0,0,0,0,0,0,0,0,0,0,0,0,0,0,0,0,0,0,0,0,0,0,0,0,0,0,0,0,0,0,0,0,0,0,0,0,0,0]
["full sample size",{"$f":"COUNTA('Sept-Raw'!A:A)-2","v":0},{"$f":"B8","v":0},0,0,0,0,0,0,0,0,0,0,0,0,0,0,0,0,0,0,0,0,0,0,0,0,0,0,0,0,0,0,0,0,0,0,0,0,0,0]
["True sample size (-NA + blanks)",{"$f":"IF(ISERROR(B8-(B6+B7)),\"\",B8-(B6+B7))","v":0},{"$f":"IF(ISERROR(C8-(C6+C7)),\"\",C8-(C6+C7))","v":0},0,0,0,0,0,0,0,0,0,0,0,0,0,0,0,0,0,0,0,0,0,0,0,0,0,0,0,0,0,0,0,0,0,0,0,0,0,0]
["%Y",{"$f":"IF(ISERROR(B3/B9),\"\",B3/B9)","v":""},{"$f":"IF(ISERROR(C3/C9),\"\",C3/C9)","v":""},"","","","","","","","","","","","","","","","","","","","","","","","","","","","","","","","","","","","","",""]
["%N",{"$f":"IF(ISERROR(B4/B9),\"\",B4/B9)","v":""},{"$f":"IF(ISERROR(C4/C9),\"\",C4/C9)","v":""},"","","","","","","","","","","","","","","","","","","","","","","","","","","","","","","","","","","","","",""]
["%N - Justified",{"$f":"IF(ISERROR(B5/B9),\"\",B5/B9)","v":""},{"$f":"IF(ISERROR(C5/C9),\"\",C5/C9)","v":""},"","","","","","","","","","","","","","","","","","","","","","","","","","","","","","","","","","","","","",""]

{"sheet":"Oct","index":24,"n_rows":51,"n_cols":8,"rows_kept":51,"cut":false,"hidden":false,"merged":[]}
["Click here to go to year overview"]
[]
["Date",null,null,"Total by Apt type"]
["Completed by",null,null,"New",{"$f":"COUNTIF('Oct-Raw'!E3:E103,\"New\")","v":0}]
["Sample group size",{"$f":"COUNTA('Oct-Raw'!A:A)-2","v":0},null,"Follow up",{"$f":"COUNTIF('Oct-Raw'!E3:E103,\"Fup\")","v":0},null,null,{"$f":"Year!H5","v":0.95}]
["Overall Result (compliant only)",{"$f":"IF(ISERROR(SUM(C11:C50)/G51),\"\",SUM(C11:C50)/G51)","v":""},null,"Total by apt Code",null,null,null,{"$f":"Year!H6","v":"80-95%"}]
["Overall Result (compliant & Justified)",{"$f":"IF(ISERROR(SUM(B11:B50)/G51),\"\",SUM(B11:B50)/G51)","v":""},null,"code goes in here",{"$f":"COUNTIF('Oct-Raw'!F3:F103,D7)","v":0},null,null,{"$f":"Year!H7","v":0.8}]
["viable qs",{"$f":"G51","v":0}]
[]
["Metric","Compliant + Justified","Compliant","Justified","Not compliant","Irritating math"]
[{"$f":"IF(ISERROR('Audit questions'!A2),\"\",'Audit questions'!A2)","v":"Test1"},{"$f":"IF(ISERROR(C11+D11),\"\",C11+D11)","v":""},{"$f":"'Oct-Data'!B10","v":""},{"$f":"'Oct-Data'!B12","v":""},{"$f":"'Oct-Data'!B11","v":""},{"$f":"COUNTIF(C11:E11,\">0\")","v":0}]
[{"$f":"IF(ISERROR('Audit questions'!A3),\"\",'Audit questions'!A3)","v":"Test2"},"",{"$f":"'Oct-Data'!C10","v":""},{"$f":"'Oct-Data'!C12","v":""},{"$f":"'Oct-Data'!C11","v":""},0]
[{"$f":"IF(ISERROR('Audit questions'!A4),\"\",'Audit questions'!A4)","v":"Test3"},"",{"$f":"'Oct-Data'!D10","v":""},{"$f":"'Oct-Data'!D12","v":""},{"$f":"'Oct-Data'!D11","v":""},0]
[{"$f":"IF(ISERROR('Audit questions'!A5),\"\",'Audit questions'!A5)","v":"Test4"},"",{"$f":"'Oct-Data'!E10","v":""},{"$f":"'Oct-Data'!E12","v":""},{"$f":"'Oct-Data'!E11","v":""},0]
[{"$f":"IF(ISERROR('Audit questions'!A6),\"\",'Audit questions'!A6)","v":"Test5"},"",{"$f":"'Oct-Data'!F10","v":""},{"$f":"'Oct-Data'!F12","v":""},{"$f":"'Oct-Data'!F11","v":""},0]
[{"$f":"IF(ISERROR('Audit questions'!A7),\"\",'Audit questions'!A7)","v":"Test6"},"",{"$f":"'Oct-Data'!G10","v":""},{"$f":"'Oct-Data'!G12","v":""},{"$f":"'Oct-Data'!G11","v":""},0]
[{"$f":"IF(ISERROR('Audit questions'!A8),\"\",'Audit questions'!A8)","v":"Test7"},"",{"$f":"'Oct-Data'!H10","v":""},{"$f":"'Oct-Data'!H12","v":""},{"$f":"'Oct-Data'!H11","v":""},0]
[{"$f":"IF(ISERROR('Audit questions'!A9),\"\",'Audit questions'!A9)","v":"Test8"},"",{"$f":"'Oct-Data'!I10","v":""},{"$f":"'Oct-Data'!I12","v":""},{"$f":"'Oct-Data'!I11","v":""},0]
[{"$f":"IF(ISERROR('Audit questions'!A10),\"\",'Audit questions'!A10)","v":"Test9"},"",{"$f":"'Oct-Data'!J10","v":""},{"$f":"'Oct-Data'!J12","v":""},{"$f":"'Oct-Data'!J11","v":""},0]
[{"$f":"IF(ISERROR('Audit questions'!A11),\"\",'Audit questions'!A11)","v":"Test10"},"",{"$f":"'Oct-Data'!K10","v":""},{"$f":"'Oct-Data'!K12","v":""},{"$f":"'Oct-Data'!K11","v":""},0]
[{"$f":"IF(ISERROR('Audit questions'!A12),\"\",'Audit questions'!A12)","v":"Test11"},"",{"$f":"'Oct-Data'!L10","v":""},{"$f":"'Oct-Data'!L12","v":""},{"$f":"'Oct-Data'!L11","v":""},0]
[{"$f":"IF(ISERROR('Audit questions'!A13),\"\",'Audit questions'!A13)","v":"Test12"},"",{"$f":"'Oct-Data'!M10","v":""},{"$f":"'Oct-Data'!M12","v":""},{"$f":"'Oct-Data'!M11","v":""},0]
[{"$f":"IF(ISERROR('Audit questions'!A14),\"\",'Audit questions'!A14)","v":"Test13"},"",{"$f":"'Oct-Data'!N10","v":""},{"$f":"'Oct-Data'!N12","v":""},{"$f":"'Oct-Data'!N11","v":""},0]
[{"$f":"IF(ISERROR('Audit questions'!A15),\"\",'Audit questions'!A15)","v":"Test14"},"",{"$f":"'Oct-Data'!O10","v":""},{"$f":"'Oct-Data'!O12","v":""},{"$f":"'Oct-Data'!O11","v":""},0]
[{"$f":"IF(ISERROR('Audit questions'!A16),\"\",'Audit questions'!A16)","v":"Test15"},"",{"$f":"'Oct-Data'!P10","v":""},{"$f":"'Oct-Data'!P12","v":""},{"$f":"'Oct-Data'!P11","v":""},0]
[{"$f":"IF(ISERROR('Audit questions'!A17),\"\",'Audit questions'!A17)","v":"Test16"},"",{"$f":"'Oct-Data'!Q10","v":""},{"$f":"'Oct-Data'!Q12","v":""},{"$f":"'Oct-Data'!Q11","v":""},0]
[{"$f":"IF(ISERROR('Audit questions'!A18),\"\",'Audit questions'!A18)","v":"Test17"},"",{"$f":"'Oct-Data'!R10","v":""},{"$f":"'Oct-Data'!R12","v":""},{"$f":"'Oct-Data'!R11","v":""},0]
[{"$f":"IF(ISERROR('Audit questions'!A19),\"\",'Audit questions'!A19)","v":"Test18"},"",{"$f":"'Oct-Data'!S10","v":""},{"$f":"'Oct-Data'!S12","v":""},{"$f":"'Oct-Data'!S11","v":""},0]
[{"$f":"IF(ISERROR('Audit questions'!A20),\"\",'Audit questions'!A20)","v":"Test19"},"",{"$f":"'Oct-Data'!T10","v":""},{"$f":"'Oct-Data'!T12","v":""},{"$f":"'Oct-Data'!T11","v":""},0]
[{"$f":"IF(ISERROR('Audit questions'!A21),\"\",'Audit questions'!A21)","v":"Test20"},"",{"$f":"'Oct-Data'!U10","v":""},{"$f":"'Oct-Data'!U12","v":""},{"$f":"'Oct-Data'!U11","v":""},0]
[{"$f":"IF(ISERROR('Audit questions'!A22),\"\",'Audit questions'!A22)","v":"Test21"},"",{"$f":"'Oct-Data'!V10","v":""},{"$f":"'Oct-Data'!V12","v":""},{"$f":"'Oct-Data'!V11","v":""},0]
[{"$f":"IF(ISERROR('Audit questions'!A23),\"\",'Audit questions'!A23)","v":"Test22"},"",{"$f":"'Oct-Data'!W10","v":""},{"$f":"'Oct-Data'!W12","v":""},{"$f":"'Oct-Data'!W11","v":""},0]
[{"$f":"IF(ISERROR('Audit questions'!A24),\"\",'Audit questions'!A24)","v":"Test23"},"",{"$f":"'Oct-Data'!X10","v":""},{"$f":"'Oct-Data'!X12","v":""},{"$f":"'Oct-Data'!X11","v":""},0]
[{"$f":"IF(ISERROR('Audit questions'!A25),\"\",'Audit questions'!A25)","v":"Test24"},"",{"$f":"'Oct-Data'!Y10","v":""},{"$f":"'Oct-Data'!Y12","v":""},{"$f":"'Oct-Data'!Y11","v":""},0]
[{"$f":"IF(ISERROR('Audit questions'!A26),\"\",'Audit questions'!A26)","v":"Test25"},"",{"$f":"'Oct-Data'!Z10","v":""},{"$f":"'Oct-Data'!Z12","v":""},{"$f":"'Oct-Data'!Z11","v":""},0]
[{"$f":"IF(ISERROR('Audit questions'!A27),\"\",'Audit questions'!A27)","v":"Test26"},"",{"$f":"'Oct-Data'!AA10","v":""},{"$f":"'Oct-Data'!AA12","v":""},{"$f":"'Oct-Data'!AA11","v":""},0]
[{"$f":"IF(ISERROR('Audit questions'!A28),\"\",'Audit questions'!A28)","v":"Test27"},"",{"$f":"'Oct-Data'!AB10","v":""},{"$f":"'Oct-Data'!AB12","v":""},{"$f":"'Oct-Data'!AB11","v":""},0]
[{"$f":"IF(ISERROR('Audit questions'!A29),\"\",'Audit questions'!A29)","v":"Test28"},"",{"$f":"'Oct-Data'!AC10","v":""},{"$f":"'Oct-Data'!AC12","v":""},{"$f":"'Oct-Data'!AC11","v":""},0]
[{"$f":"IF(ISERROR('Audit questions'!A30),\"\",'Audit questions'!A30)","v":"Test29"},"",{"$f":"'Oct-Data'!AD10","v":""},{"$f":"'Oct-Data'!AD12","v":""},{"$f":"'Oct-Data'!AD11","v":""},0]
[{"$f":"IF(ISERROR('Audit questions'!A31),\"\",'Audit questions'!A31)","v":"Test30"},"",{"$f":"'Oct-Data'!AE10","v":""},{"$f":"'Oct-Data'!AE12","v":""},{"$f":"'Oct-Data'!AE11","v":""},0]
[{"$f":"IF(ISERROR('Audit questions'!A32),\"\",'Audit questions'!A32)","v":"Test31"},"",{"$f":"'Oct-Data'!AF10","v":""},{"$f":"'Oct-Data'!AF12","v":""},{"$f":"'Oct-Data'!AF11","v":""},0]
[{"$f":"IF(ISERROR('Audit questions'!A33),\"\",'Audit questions'!A33)","v":"Test32"},"",{"$f":"'Oct-Data'!AG10","v":""},{"$f":"'Oct-Data'!AG12","v":""},{"$f":"'Oct-Data'!AG11","v":""},0]
[{"$f":"IF(ISERROR('Audit questions'!A34),\"\",'Audit questions'!A34)","v":"Test33"},"",{"$f":"'Oct-Data'!AH10","v":""},{"$f":"'Oct-Data'!AH12","v":""},{"$f":"'Oct-Data'!AH11","v":""},0]
[{"$f":"IF(ISERROR('Audit questions'!A35),\"\",'Audit questions'!A35)","v":"Test34"},"",{"$f":"'Oct-Data'!AI10","v":""},{"$f":"'Oct-Data'!AI12","v":""},{"$f":"'Oct-Data'!AI11","v":""},0]
[{"$f":"IF(ISERROR('Audit questions'!A36),\"\",'Audit questions'!A36)","v":"Test35"},"",{"$f":"'Oct-Data'!AJ10","v":""},{"$f":"'Oct-Data'!AJ12","v":""},{"$f":"'Oct-Data'!AJ11","v":""},0]
[{"$f":"IF(ISERROR('Audit questions'!A37),\"\",'Audit questions'!A37)","v":"Test36"},"",{"$f":"'Oct-Data'!AK10","v":""},{"$f":"'Oct-Data'!AK12","v":""},{"$f":"'Oct-Data'!AK11","v":""},0]
[{"$f":"IF(ISERROR('Audit questions'!A38),\"\",'Audit questions'!A38)","v":"Test37"},"",{"$f":"'Oct-Data'!AL10","v":""},{"$f":"'Oct-Data'!AL12","v":""},{"$f":"'Oct-Data'!AL11","v":""},0]
[{"$f":"IF(ISERROR('Audit questions'!A39),\"\",'Audit questions'!A39)","v":"Test38"},"",{"$f":"'Oct-Data'!AM10","v":""},{"$f":"'Oct-Data'!AM12","v":""},{"$f":"'Oct-Data'!AM11","v":""},0]
[{"$f":"IF(ISERROR('Audit questions'!A40),\"\",'Audit questions'!A40)","v":"Test39"},"",{"$f":"'Oct-Data'!AN10","v":""},{"$f":"'Oct-Data'!AN12","v":""},{"$f":"'Oct-Data'!AN11","v":""},0]
[{"$f":"IF(ISERROR('Audit questions'!A41),\"\",'Audit questions'!A41)","v":"Test40"},"",{"$f":"'Oct-Data'!AO10","v":""},{"$f":"'Oct-Data'!AO12","v":""},{"$f":"'Oct-Data'!AO11","v":""},0]
[null,null,null,null,null,null,{"$f":"COUNTIF(F11:F50,\">=1\")","v":0}]

{"sheet":"Oct-Raw","index":25,"n_rows":2,"n_cols":87,"rows_kept":2,"cut":false,"hidden":true,"merged":[[0,85,0,86],[0,63,0,64],[0,65,0,66],[0,67,0,68],[0,69,0,70],[0,71,0,72],[0,73,0,74],[0,75,0,76],[0,77,0,78],[0,79,0,80],[0,81,0,82],[0,83,0,84],[0,61,0,62],[0,39,0,40],[0,41,0,42],[0,43,0,44],[0,45,0,46],[0,47,0,48],[0,49,0,50],[0,51,0,52],[0,53,0,54],[0,55,0,56],[0,57,0,58],[0,59,0,60],[0,37,0,38],[0,15,0,16],[0,17,0,18],[0,19,0,20],[0,21,0,22],[0,23,0,24],[0,25,0,26],[0,27,0,28],[0,29,0,30],[0,31,0,32],[0,33,0,34],[0,35,0,36],[0,13,0,14],[0,0,0,5],[0,6,1,6],[0,7,0,8],[0,9,0,10],[0,11,0,12]]}
["Record details",null,null,null,null,null,"Notes",{"$f":"'Audit questions'!A2","v":"Test1"},null,{"$f":"'Audit questions'!A3","v":"Test2"},null,{"$f":"'Audit questions'!A4","v":"Test3"},null,{"$f":"'Audit questions'!A5","v":"Test4"},null,{"$f":"'Audit questions'!A6","v":"Test5"},null,{"$f":"'Audit questions'!A7","v":"Test6"},null,{"$f":"'Audit questions'!A8","v":"Test7"},null,{"$f":"'Audit questions'!A9","v":"Test8"},null,{"$f":"'Audit questions'!A10","v":"Test9"},null,{"$f":"'Audit questions'!A11","v":"Test10"},null,{"$f":"'Audit questions'!A12","v":"Test11"},null,{"$f":"'Audit questions'!A13","v":"Test12"},null,{"$f":"'Audit questions'!A14","v":"Test13"},null,{"$f":"'Audit questions'!A15","v":"Test14"},null,{"$f":"'Audit questions'!A16","v":"Test15"},null,{"$f":"'Audit questions'!A17","v":"Test16"},null,{"$f":"'Audit questions'!A18","v":"Test17"},null,{"$f":"'Audit questions'!A19","v":"Test18"},null,{"$f":"'Audit questions'!A20","v":"Test19"},null,{"$f":"'Audit questions'!A21","v":"Test20"},null,{"$f":"'Audit questions'!A22","v":"Test21"},null,{"$f":"'Audit questions'!A23","v":"Test22"},null,{"$f":"'Audit questions'!A24","v":"Test23"},null,{"$f":"'Audit questions'!A25","v":"Test24"},null,{"$f":"'Audit questions'!A26","v":"Test25"},null,{"$f":"'Audit questions'!A27","v":"Test26"},null,{"$f":"'Audit questions'!A28","v":"Test27"},null,{"$f":"'Audit questions'!A29","v":"Test28"},null,{"$f":"'Audit questions'!A30","v":"Test29"},null,{"$f":"'Audit questions'!A31","v":"Test30"},null,{"$f":"'Audit questions'!A32","v":"Test31"},null,{"$f":"'Audit questions'!A33","v":"Test32"},null,{"$f":"'Audit questions'!A34","v":"Test33"},null,{"$f":"'Audit questions'!A35","v":"Test34"},null,{"$f":"'Audit questions'!A36","v":"Test35"},null,{"$f":"'Audit questions'!A37","v":"Test36"},null,{"$f":"'Audit questions'!A38","v":"Test37"},null,{"$f":"'Audit questions'!A39","v":"Test38"},null,{"$f":"'Audit questions'!A40","v":"Test39"},null,{"$f":"'Audit questions'!A41","v":"Test40"}]
["Pt number","Date seen","Clinician 1","clinician 2","New/ F-up","Apt code",null,"Compliant?","Other result","Compliant?","Other result","Compliant?","Other result","Compliant?","Other result","Compliant?","Other result","Compliant?","Other result","Compliant?","Other result","Compliant?","Other result","Compliant?","Other result","Compliant?","Other result","Compliant?","Other result","Compliant?","Other result","Compliant?","Other result","Compliant?","Other result","Compliant?","Other result","Compliant?","Other result","Compliant?","Other result","Compliant?","Other result","Compliant?","Other result","Compliant?","Other result","Compliant?","Other result","Compliant?","Other result","Compliant?","Other result","Compliant?","Other result","Compliant?","Other result","Compliant?","Other result","Compliant?","Other result","Compliant?","Other result","Compliant?","Other result","Compliant?","Other result","Compliant?","Other result","Compliant?","Other result","Compliant?","Other result","Compliant?","Other result","Compliant?","Other result","Compliant?","Other result","Compliant?","Other result","Compliant?","Other result","Compliant?","Other result","Compliant?","Other result"]

{"sheet":"Oct-Data","index":26,"n_rows":12,"n_cols":41,"rows_kept":12,"cut":false,"hidden":true,"merged":[[0,0,1,0]]}
["Results",{"$f":"'Audit questions'!A2","v":"Test1"},{"$f":"'Audit questions'!A3","v":"Test2"},{"$f":"'Audit questions'!A4","v":"Test3"},{"$f":"'Audit questions'!A5","v":"Test4"},{"$f":"'Audit questions'!A6","v":"Test5"},{"$f":"'Audit questions'!A7","v":"Test6"},{"$f":"'Audit questions'!A8","v":"Test7"},{"$f":"'Audit questions'!A9","v":"Test8"},{"$f":"'Audit questions'!A10","v":"Test9"},{"$f":"'Audit questions'!A11","v":"Test10"},{"$f":"'Audit questions'!A12","v":"Test11"},{"$f":"'Audit questions'!A13","v":"Test12"},{"$f":"'Audit questions'!A14","v":"Test13"},{"$f":"'Audit questions'!A15","v":"Test14"},{"$f":"'Audit questions'!A16","v":"Test15"},{"$f":"'Audit questions'!A17","v":"Test16"},{"$f":"'Audit questions'!A18","v":"Test17"},{"$f":"'Audit questions'!A19","v":"Test18"},{"$f":"'Audit questions'!A20","v":"Test19"},{"$f":"'Audit questions'!A21","v":"Test20"},{"$f":"'Audit questions'!A22","v":"Test21"},{"$f":"'Audit questions'!A23","v":"Test22"},{"$f":"'Audit questions'!A24","v":"Test23"},{"$f":"'Audit questions'!A25","v":"Test24"},{"$f":"'Audit questions'!A26","v":"Test25"},{"$f":"'Audit questions'!A27","v":"Test26"},{"$f":"'Audit questions'!A28","v":"Test27"},{"$f":"'Audit questions'!A29","v":"Test28"},{"$f":"'Audit questions'!A30","v":"Test29"},{"$f":"'Audit questions'!A31","v":"Test30"},{"$f":"'Audit questions'!A32","v":"Test31"},{"$f":"'Audit questions'!A33","v":"Test32"},{"$f":"'Audit questions'!A34","v":"Test33"},{"$f":"'Audit questions'!A35","v":"Test34"},{"$f":"'Audit questions'!A36","v":"Test35"},{"$f":"'Audit questions'!A37","v":"Test36"},{"$f":"'Audit questions'!A38","v":"Test37"},{"$f":"'Audit questions'!A39","v":"Test38"},{"$f":"'Audit questions'!A40","v":"Test39"},{"$f":"'Audit questions'!A41","v":"Test40"}]
[null,"Compliant?","Compliant?","Compliant?","Compliant?","Compliant?","Compliant?","Compliant?","Compliant?","Compliant?","Compliant?","Compliant?","Compliant?","Compliant?","Compliant?","Compliant?","Compliant?","Compliant?","Compliant?","Compliant?","Compliant?","Compliant?","Compliant?","Compliant?","Compliant?","Compliant?","Compliant?","Compliant?","Compliant?","Compliant?","Compliant?","Compliant?","Compliant?","Compliant?","Compliant?","Compliant?","Compliant?","Compliant?","Compliant?","Compliant?","Compliant?"]
["Total Y",{"$f":"COUNTIF('Oct-Raw'!H:H,\"yes\")","v":0},{"$f":"COUNTIF('Oct-Raw'!J:J,\"yes\")","v":0},{"$f":"COUNTIF('Oct-Raw'!L:L,\"yes\")","v":0},{"$f":"COUNTIF('Oct-Raw'!N:N,\"yes\")","v":0},{"$f":"COUNTIF('Oct-Raw'!P:P,\"yes\")","v":0},{"$f":"COUNTIF('Oct-Raw'!R:R,\"yes\")","v":0},{"$f":"COUNTIF('Oct-Raw'!T:T,\"yes\")","v":0},{"$f":"COUNTIF('Oct-Raw'!V:V,\"yes\")","v":0},{"$f":"COUNTIF('Oct-Raw'!X:X,\"yes\")","v":0},{"$f":"COUNTIF('Oct-Raw'!Z:Z,\"yes\")","v":0},{"$f":"COUNTIF('Oct-Raw'!AB:AB,\"yes\")","v":0},{"$f":"COUNTIF('Oct-Raw'!AD:AD,\"yes\")","v":0},{"$f":"COUNTIF('Oct-Raw'!AF:AF,\"yes\")","v":0},{"$f":"COUNTIF('Oct-Raw'!AH:AH,\"yes\")","v":0},{"$f":"COUNTIF('Oct-Raw'!AJ:AJ,\"yes\")","v":0},{"$f":"COUNTIF('Oct-Raw'!AL:AL,\"yes\")","v":0},{"$f":"COUNTIF('Oct-Raw'!AN:AN,\"yes\")","v":0},{"$f":"COUNTIF('Oct-Raw'!AP:AP,\"yes\")","v":0},{"$f":"COUNTIF('Oct-Raw'!AR:AR,\"yes\")","v":0},{"$f":"COUNTIF('Oct-Raw'!AT:AT,\"yes\")","v":0},{"$f":"COUNTIF('Oct-Raw'!AV:AV,\"yes\")","v":0},{"$f":"COUNTIF('Oct-Raw'!AX:AX,\"yes\")","v":0},{"$f":"COUNTIF('Oct-Raw'!AZ:AZ,\"yes\")","v":0},{"$f":"COUNTIF('Oct-Raw'!BB:BB,\"yes\")","v":0},{"$f":"COUNTIF('Oct-Raw'!BD:BD,\"yes\")","v":0},{"$f":"COUNTIF('Oct-Raw'!BF:BF,\"yes\")","v":0},{"$f":"COUNTIF('Oct-Raw'!BH:BH,\"yes\")","v":0},{"$f":"COUNTIF('Oct-Raw'!BJ:BJ,\"yes\")","v":0},{"$f":"COUNTIF('Oct-Raw'!BL:BL,\"yes\")","v":0},{"$f":"COUNTIF('Oct-Raw'!BN:BN,\"yes\")","v":0},{"$f":"COUNTIF('Oct-Raw'!BP:BP,\"yes\")","v":0},{"$f":"COUNTIF('Oct-Raw'!BR:BR,\"yes\")","v":0},{"$f":"COUNTIF('Oct-Raw'!BT:BT,\"yes\")","v":0},{"$f":"COUNTIF('Oct-Raw'!BV:BV,\"yes\")","v":0},{"$f":"COUNTIF('Oct-Raw'!BX:BX,\"yes\")","v":0},{"$f":"COUNTIF('Oct-Raw'!BZ:BZ,\"yes\")","v":0},{"$f":"COUNTIF('Oct-Raw'!CB:CB,\"yes\")","v":0},{"$f":"COUNTIF('Oct-Raw'!CD:CD,\"yes\")","v":0},{"$f":"COUNTIF('Oct-Raw'!CF:CF,\"yes\")","v":0},{"$f":"COUNTIF('Oct-Raw'!CH:CH,\"yes\")","v":0}]
["Total N",{"$f":"COUNTIF('Oct-Raw'!H:H,\"no\")","v":0},{"$f":"COUNTIF('Oct-Raw'!J:J,\"no\")","v":0},{"$f":"COUNTIF('Oct-Raw'!L:L,\"no\")","v":0},{"$f":"COUNTIF('Oct-Raw'!N:N,\"no\")","v":0},{"$f":"COUNTIF('Oct-Raw'!P:P,\"no\")","v":0},{"$f":"COUNTIF('Oct-Raw'!R:R,\"no\")","v":0},{"$f":"COUNTIF('Oct-Raw'!T:T,\"no\")","v":0},{"$f":"COUNTIF('Oct-Raw'!V:V,\"no\")","v":0},{"$f":"COUNTIF('Oct-Raw'!X:X,\"no\")","v":0},{"$f":"COUNTIF('Oct-Raw'!Z:Z,\"no\")","v":0},{"$f":"COUNTIF('Oct-Raw'!AB:AB,\"no\")","v":0},{"$f":"COUNTIF('Oct-Raw'!AD:AD,\"no\")","v":0},{"$f":"COUNTIF('Oct-Raw'!AF:AF,\"no\")","v":0},{"$f":"COUNTIF('Oct-Raw'!AH:AH,\"no\")","v":0},{"$f":"COUNTIF('Oct-Raw'!AJ:AJ,\"no\")","v":0},{"$f":"COUNTIF('Oct-Raw'!AL:AL,\"no\")","v":0},{"$f":"COUNTIF('Oct-Raw'!AN:AN,\"no\")","v":0},{"$f":"COUNTIF('Oct-Raw'!AP:AP,\"no\")","v":0},{"$f":"COUNTIF('Oct-Raw'!AR:AR,\"no\")","v":0},{"$f":"COUNTIF('Oct-Raw'!AT:AT,\"no\")","v":0},{"$f":"COUNTIF('Oct-Raw'!AV:AV,\"no\")","v":0},{"$f":"COUNTIF('Oct-Raw'!AX:AX,\"no\")","v":0},{"$f":"COUNTIF('Oct-Raw'!AZ:AZ,\"no\")","v":0},{"$f":"COUNTIF('Oct-Raw'!BB:BB,\"no\")","v":0},{"$f":"COUNTIF('Oct-Raw'!BD:BD,\"no\")","v":0},{"$f":"COUNTIF('Oct-Raw'!BF:BF,\"no\")","v":0},{"$f":"COUNTIF('Oct-Raw'!BH:BH,\"no\")","v":0},{"$f":"COUNTIF('Oct-Raw'!BJ:BJ,\"no\")","v":0},{"$f":"COUNTIF('Oct-Raw'!BL:BL,\"no\")","v":0},{"$f":"COUNTIF('Oct-Raw'!BN:BN,\"no\")","v":0},{"$f":"COUNTIF('Oct-Raw'!BP:BP,\"no\")","v":0},{"$f":"COUNTIF('Oct-Raw'!BR:BR,\"no\")","v":0},{"$f":"COUNTIF('Oct-Raw'!BT:BT,\"no\")","v":0},{"$f":"COUNTIF('Oct-Raw'!BV:BV,\"no\")","v":0},{"$f":"COUNTIF('Oct-Raw'!BX:BX,\"no\")","v":0},{"$f":"COUNTIF('Oct-Raw'!BZ:BZ,\"no\")","v":0},{"$f":"COUNTIF('Oct-Raw'!CB:CB,\"no\")","v":0},{"$f":"COUNTIF('Oct-Raw'!CD:CD,\"no\")","v":0},{"$f":"COUNTIF('Oct-Raw'!CF:CF,\"no\")","v":0},{"$f":"COUNTIF('Oct-Raw'!CH:CH,\"no\")","v":0}]
["Total Justified",{"$f":"COUNTIF('Oct-Raw'!H:H,\"Justified\")","v":0},{"$f":"COUNTIF('Oct-Raw'!J:J,\"Justified\")","v":0},{"$f":"COUNTIF('Oct-Raw'!L:L,\"Justified\")","v":0},{"$f":"COUNTIF('Oct-Raw'!N:N,\"Justified\")","v":0},{"$f":"COUNTIF('Oct-Raw'!P:P,\"Justified\")","v":0},{"$f":"COUNTIF('Oct-Raw'!R:R,\"Justified\")","v":0},{"$f":"COUNTIF('Oct-Raw'!T:T,\"Justified\")","v":0},{"$f":"COUNTIF('Oct-Raw'!V:V,\"Justified\")","v":0},{"$f":"COUNTIF('Oct-Raw'!X:X,\"Justified\")","v":0},{"$f":"COUNTIF('Oct-Raw'!Z:Z,\"Justified\")","v":0},{"$f":"COUNTIF('Oct-Raw'!AB:AB,\"Justified\")","v":0},{"$f":"COUNTIF('Oct-Raw'!AD:AD,\"Justified\")","v":0},{"$f":"COUNTIF('Oct-Raw'!AF:AF,\"Justified\")","v":0},{"$f":"COUNTIF('Oct-Raw'!AH:AH,\"Justified\")","v":0},{"$f":"COUNTIF('Oct-Raw'!AJ:AJ,\"Justified\")","v":0},{"$f":"COUNTIF('Oct-Raw'!AL:AL,\"Justified\")","v":0},{"$f":"COUNTIF('Oct-Raw'!AN:AN,\"Justified\")","v":0},{"$f":"COUNTIF('Oct-Raw'!AP:AP,\"Justified\")","v":0},{"$f":"COUNTIF('Oct-Raw'!AR:AR,\"Justified\")","v":0},{"$f":"COUNTIF('Oct-Raw'!AT:AT,\"Justified\")","v":0},{"$f":"COUNTIF('Oct-Raw'!AV:AV,\"Justified\")","v":0},{"$f":"COUNTIF('Oct-Raw'!AX:AX,\"Justified\")","v":0},{"$f":"COUNTIF('Oct-Raw'!AZ:AZ,\"Justified\")","v":0},{"$f":"COUNTIF('Oct-Raw'!BB:BB,\"Justified\")","v":0},{"$f":"COUNTIF('Oct-Raw'!BD:BD,\"Justified\")","v":0},{"$f":"COUNTIF('Oct-Raw'!BF:BF,\"Justified\")","v":0},{"$f":"COUNTIF('Oct-Raw'!BH:BH,\"Justified\")","v":0},{"$f":"COUNTIF('Oct-Raw'!BJ:BJ,\"Justified\")","v":0},{"$f":"COUNTIF('Oct-Raw'!BL:BL,\"Justified\")","v":0},{"$f":"COUNTIF('Oct-Raw'!BN:BN,\"Justified\")","v":0},{"$f":"COUNTIF('Oct-Raw'!BP:BP,\"Justified\")","v":0},{"$f":"COUNTIF('Oct-Raw'!BR:BR,\"Justified\")","v":0},{"$f":"COUNTIF('Oct-Raw'!BT:BT,\"Justified\")","v":0},{"$f":"COUNTIF('Oct-Raw'!BV:BV,\"Justified\")","v":0},{"$f":"COUNTIF('Oct-Raw'!BX:BX,\"Justified\")","v":0},{"$f":"COUNTIF('Oct-Raw'!BZ:BZ,\"Justified\")","v":0},{"$f":"COUNTIF('Oct-Raw'!CB:CB,\"Justified\")","v":0},{"$f":"COUNTIF('Oct-Raw'!CD:CD,\"Justified\")","v":0},{"$f":"COUNTIF('Oct-Raw'!CF:CF,\"Justified\")","v":0},{"$f":"COUNTIF('Oct-Raw'!CH:CH,\"Justified\")","v":0}]
["Total NA",{"$f":"COUNTIF('Oct-Raw'!H:H,\"NA\")","v":0},{"$f":"COUNTIF('Oct-Raw'!J:J,\"NA\")","v":0},{"$f":"COUNTIF('Oct-Raw'!L:L,\"NA\")","v":0},{"$f":"COUNTIF('Oct-Raw'!N:N,\"NA\")","v":0},{"$f":"COUNTIF('Oct-Raw'!P:P,\"NA\")","v":0},{"$f":"COUNTIF('Oct-Raw'!R:R,\"NA\")","v":0},{"$f":"COUNTIF('Oct-Raw'!T:T,\"NA\")","v":0},{"$f":"COUNTIF('Oct-Raw'!V:V,\"NA\")","v":0},{"$f":"COUNTIF('Oct-Raw'!X:X,\"NA\")","v":0},{"$f":"COUNTIF('Oct-Raw'!Z:Z,\"NA\")","v":0},{"$f":"COUNTIF('Oct-Raw'!AB:AB,\"NA\")","v":0},{"$f":"COUNTIF('Oct-Raw'!AD:AD,\"NA\")","v":0},{"$f":"COUNTIF('Oct-Raw'!AF:AF,\"NA\")","v":0},{"$f":"COUNTIF('Oct-Raw'!AH:AH,\"NA\")","v":0},{"$f":"COUNTIF('Oct-Raw'!AJ:AJ,\"NA\")","v":0},{"$f":"COUNTIF('Oct-Raw'!AL:AL,\"NA\")","v":0},{"$f":"COUNTIF('Oct-Raw'!AN:AN,\"NA\")","v":0},{"$f":"COUNTIF('Oct-Raw'!AP:AP,\"NA\")","v":0},{"$f":"COUNTIF('Oct-Raw'!AR:AR,\"NA\")","v":0},{"$f":"COUNTIF('Oct-Raw'!AT:AT,\"NA\")","v":0},{"$f":"COUNTIF('Oct-Raw'!AV:AV,\"NA\")","v":0},{"$f":"COUNTIF('Oct-Raw'!AX:AX,\"NA\")","v":0},{"$f":"COUNTIF('Oct-Raw'!AZ:AZ,\"NA\")","v":0},{"$f":"COUNTIF('Oct-Raw'!BB:BB,\"NA\")","v":0},{"$f":"COUNTIF('Oct-Raw'!BD:BD,\"NA\")","v":0},{"$f":"COUNTIF('Oct-Raw'!BF:BF,\"NA\")","v":0},{"$f":"COUNTIF('Oct-Raw'!BH:BH,\"NA\")","v":0},{"$f":"COUNTIF('Oct-Raw'!BJ:BJ,\"NA\")","v":0},{"$f":"COUNTIF('Oct-Raw'!BL:BL,\"NA\")","v":0},{"$f":"COUNTIF('Oct-Raw'!BN:BN,\"NA\")","v":0},{"$f":"COUNTIF('Oct-Raw'!BP:BP,\"NA\")","v":0},{"$f":"COUNTIF('Oct-Raw'!BR:BR,\"NA\")","v":0},{"$f":"COUNTIF('Oct-Raw'!BT:BT,\"NA\")","v":0},{"$f":"COUNTIF('Oct-Raw'!BV:BV,\"NA\")","v":0},{"$f":"COUNTIF('Oct-Raw'!BX:BX,\"NA\")","v":0},{"$f":"COUNTIF('Oct-Raw'!BZ:BZ,\"NA\")","v":0},{"$f":"COUNTIF('Oct-Raw'!CB:CB,\"NA\")","v":0},{"$f":"COUNTIF('Oct-Raw'!CD:CD,\"NA\")","v":0},{"$f":"COUNTIF('Oct-Raw'!CF:CF,\"NA\")","v":0},{"$f":"COUNTIF('Oct-Raw'!CH:CH,\"NA\")","v":0}]
["Blanks",{"$f":"B8-(SUM(B3:B6))","v":0},{"$f":"C8-(SUM(C3:C6))","v":0},0,0,0,0,0,0,0,0,0,0,0,0,0,0,0,0,0,0,0,0,0,0,0,0,0,0,0,0,0,0,0,0,0,0,0,0,0,0]
["full sample size",{"$f":"COUNTA('Oct-Raw'!A:A)-2","v":0},{"$f":"B8","v":0},0,0,0,0,0,0,0,0,0,0,0,0,0,0,0,0,0,0,0,0,0,0,0,0,0,0,0,0,0,0,0,0,0,0,0,0,0,0]
["True sample size (-NA + blanks)",{"$f":"IF(ISERROR(B8-(B6+B7)),\"\",B8-(B6+B7))","v":0},{"$f":"IF(ISERROR(C8-(C6+C7)),\"\",C8-(C6+C7))","v":0},0,0,0,0,0,0,0,0,0,0,0,0,0,0,0,0,0,0,0,0,0,0,0,0,0,0,0,0,0,0,0,0,0,0,0,0,0,0]
["%Y",{"$f":"IF(ISERROR(B3/B9),\"\",B3/B9)","v":""},{"$f":"IF(ISERROR(C3/C9),\"\",C3/C9)","v":""},"","","","","","","","","","","","","","","","","","","","","","","","","","","","","","","","","","","","","",""]
["%N",{"$f":"IF(ISERROR(B4/B9),\"\",B4/B9)","v":""},{"$f":"IF(ISERROR(C4/C9),\"\",C4/C9)","v":""},"","","","","","","","","","","","","","","","","","","","","","","","","","","","","","","","","","","","","",""]
["%N - Justified",{"$f":"IF(ISERROR(B5/B9),\"\",B5/B9)","v":""},{"$f":"IF(ISERROR(C5/C9),\"\",C5/C9)","v":""},"","","","","","","","","","","","","","","","","","","","","","","","","","","","","","","","","","","","","",""]

{"sheet":"Nov","index":27,"n_rows":51,"n_cols":8,"rows_kept":51,"cut":false,"hidden":false,"merged":[]}
["Click here to go to year overview"]
[]
["Date",null,null,"Total by Apt type"]
["Completed by",null,null,"New",{"$f":"COUNTIF('Apr-Raw'!E3:E103,\"New\")","v":0}]
["Sample group size",{"$f":"COUNTA('Nov-Raw'!A:A)-2","v":0},null,"Follow up",{"$f":"COUNTIF('Nov-Raw'!E3:E103,\"Fup\")","v":0},null,null,{"$f":"Year!H5","v":0.95}]
["Overall Result (compliant only)",{"$f":"IF(ISERROR(SUM(C11:C50)/G51),\"\",SUM(C11:C50)/G51)","v":""},null,"Total by apt Code",null,null,null,{"$f":"Year!H6","v":"80-95%"}]
["Overall Result (compliant & Justified)",{"$f":"IF(ISERROR(SUM(B11:B50)/G51),\"\",SUM(B11:B50)/G51)","v":""},null,"code goes in here",{"$f":"COUNTIF('Nov-Raw'!F3:F103,D7)","v":0},null,null,{"$f":"Year!H7","v":0.8}]
["viable qs",{"$f":"G51","v":0}]
[]
["Metric","Compliant + Justified","Compliant","Justified","Not compliant","Irritating math"]
[{"$f":"IF(ISERROR('Audit questions'!A2),\"\",'Audit questions'!A2)","v":"Test1"},{"$f":"IF(ISERROR(C11+D11),\"\",C11+D11)","v":""},{"$f":"'Nov-Data'!B10","v":""},{"$f":"'Nov-Data'!B12","v":""},{"$f":"'Nov-Data'!B11","v":""},{"$f":"COUNTIF(C11:E11,\">0\")","v":0}]
[{"$f":"IF(ISERROR('Audit questions'!A3),\"\",'Audit questions'!A3)","v":"Test2"},"",{"$f":"'Nov-Data'!C10","v":""},{"$f":"'Nov-Data'!C12","v":""},{"$f":"'Nov-Data'!C11","v":""},0]
[{"$f":"IF(ISERROR('Audit questions'!A4),\"\",'Audit questions'!A4)","v":"Test3"},"",{"$f":"'Nov-Data'!D10","v":""},{"$f":"'Nov-Data'!D12","v":""},{"$f":"'Nov-Data'!D11","v":""},0]
[{"$f":"IF(ISERROR('Audit questions'!A5),\"\",'Audit questions'!A5)","v":"Test4"},"",{"$f":"'Nov-Data'!E10","v":""},{"$f":"'Nov-Data'!E12","v":""},{"$f":"'Nov-Data'!E11","v":""},0]
[{"$f":"IF(ISERROR('Audit questions'!A6),\"\",'Audit questions'!A6)","v":"Test5"},"",{"$f":"'Nov-Data'!F10","v":""},{"$f":"'Nov-Data'!F12","v":""},{"$f":"'Nov-Data'!F11","v":""},0]
[{"$f":"IF(ISERROR('Audit questions'!A7),\"\",'Audit questions'!A7)","v":"Test6"},"",{"$f":"'Nov-Data'!G10","v":""},{"$f":"'Nov-Data'!G12","v":""},{"$f":"'Nov-Data'!G11","v":""},0]
[{"$f":"IF(ISERROR('Audit questions'!A8),\"\",'Audit questions'!A8)","v":"Test7"},"",{"$f":"'Nov-Data'!H10","v":""},{"$f":"'Nov-Data'!H12","v":""},{"$f":"'Nov-Data'!H11","v":""},0]
[{"$f":"IF(ISERROR('Audit questions'!A9),\"\",'Audit questions'!A9)","v":"Test8"},"",{"$f":"'Nov-Data'!I10","v":""},{"$f":"'Nov-Data'!I12","v":""},{"$f":"'Nov-Data'!I11","v":""},0]
[{"$f":"IF(ISERROR('Audit questions'!A10),\"\",'Audit questions'!A10)","v":"Test9"},"",{"$f":"'Nov-Data'!J10","v":""},{"$f":"'Nov-Data'!J12","v":""},{"$f":"'Nov-Data'!J11","v":""},0]
[{"$f":"IF(ISERROR('Audit questions'!A11),\"\",'Audit questions'!A11)","v":"Test10"},"",{"$f":"'Nov-Data'!K10","v":""},{"$f":"'Nov-Data'!K12","v":""},{"$f":"'Nov-Data'!K11","v":""},0]
[{"$f":"IF(ISERROR('Audit questions'!A12),\"\",'Audit questions'!A12)","v":"Test11"},"",{"$f":"'Nov-Data'!L10","v":""},{"$f":"'Nov-Data'!L12","v":""},{"$f":"'Nov-Data'!L11","v":""},0]
[{"$f":"IF(ISERROR('Audit questions'!A13),\"\",'Audit questions'!A13)","v":"Test12"},"",{"$f":"'Nov-Data'!M10","v":""},{"$f":"'Nov-Data'!M12","v":""},{"$f":"'Nov-Data'!M11","v":""},0]
[{"$f":"IF(ISERROR('Audit questions'!A14),\"\",'Audit questions'!A14)","v":"Test13"},"",{"$f":"'Nov-Data'!N10","v":""},{"$f":"'Nov-Data'!N12","v":""},{"$f":"'Nov-Data'!N11","v":""},0]
[{"$f":"IF(ISERROR('Audit questions'!A15),\"\",'Audit questions'!A15)","v":"Test14"},"",{"$f":"'Nov-Data'!O10","v":""},{"$f":"'Nov-Data'!O12","v":""},{"$f":"'Nov-Data'!O11","v":""},0]
[{"$f":"IF(ISERROR('Audit questions'!A16),\"\",'Audit questions'!A16)","v":"Test15"},"",{"$f":"'Nov-Data'!P10","v":""},{"$f":"'Nov-Data'!P12","v":""},{"$f":"'Nov-Data'!P11","v":""},0]
[{"$f":"IF(ISERROR('Audit questions'!A17),\"\",'Audit questions'!A17)","v":"Test16"},"",{"$f":"'Nov-Data'!Q10","v":""},{"$f":"'Nov-Data'!Q12","v":""},{"$f":"'Nov-Data'!Q11","v":""},0]
[{"$f":"IF(ISERROR('Audit questions'!A18),\"\",'Audit questions'!A18)","v":"Test17"},"",{"$f":"'Nov-Data'!R10","v":""},{"$f":"'Nov-Data'!R12","v":""},{"$f":"'Nov-Data'!R11","v":""},0]
[{"$f":"IF(ISERROR('Audit questions'!A19),\"\",'Audit questions'!A19)","v":"Test18"},"",{"$f":"'Nov-Data'!S10","v":""},{"$f":"'Nov-Data'!S12","v":""},{"$f":"'Nov-Data'!S11","v":""},0]
[{"$f":"IF(ISERROR('Audit questions'!A20),\"\",'Audit questions'!A20)","v":"Test19"},"",{"$f":"'Nov-Data'!T10","v":""},{"$f":"'Nov-Data'!T12","v":""},{"$f":"'Nov-Data'!T11","v":""},0]
[{"$f":"IF(ISERROR('Audit questions'!A21),\"\",'Audit questions'!A21)","v":"Test20"},"",{"$f":"'Nov-Data'!U10","v":""},{"$f":"'Nov-Data'!U12","v":""},{"$f":"'Nov-Data'!U11","v":""},0]
[{"$f":"IF(ISERROR('Audit questions'!A22),\"\",'Audit questions'!A22)","v":"Test21"},"",{"$f":"'Nov-Data'!V10","v":""},{"$f":"'Nov-Data'!V12","v":""},{"$f":"'Nov-Data'!V11","v":""},0]
[{"$f":"IF(ISERROR('Audit questions'!A23),\"\",'Audit questions'!A23)","v":"Test22"},"",{"$f":"'Nov-Data'!W10","v":""},{"$f":"'Nov-Data'!W12","v":""},{"$f":"'Nov-Data'!W11","v":""},0]
[{"$f":"IF(ISERROR('Audit questions'!A24),\"\",'Audit questions'!A24)","v":"Test23"},"",{"$f":"'Nov-Data'!X10","v":""},{"$f":"'Nov-Data'!X12","v":""},{"$f":"'Nov-Data'!X11","v":""},0]
[{"$f":"IF(ISERROR('Audit questions'!A25),\"\",'Audit questions'!A25)","v":"Test24"},"",{"$f":"'Nov-Data'!Y10","v":""},{"$f":"'Nov-Data'!Y12","v":""},{"$f":"'Nov-Data'!Y11","v":""},0]
[{"$f":"IF(ISERROR('Audit questions'!A26),\"\",'Audit questions'!A26)","v":"Test25"},"",{"$f":"'Nov-Data'!Z10","v":""},{"$f":"'Nov-Data'!Z12","v":""},{"$f":"'Nov-Data'!Z11","v":""},0]
[{"$f":"IF(ISERROR('Audit questions'!A27),\"\",'Audit questions'!A27)","v":"Test26"},"",{"$f":"'Nov-Data'!AA10","v":""},{"$f":"'Nov-Data'!AA12","v":""},{"$f":"'Nov-Data'!AA11","v":""},0]
[{"$f":"IF(ISERROR('Audit questions'!A28),\"\",'Audit questions'!A28)","v":"Test27"},"",{"$f":"'Nov-Data'!AB10","v":""},{"$f":"'Nov-Data'!AB12","v":""},{"$f":"'Nov-Data'!AB11","v":""},0]
[{"$f":"IF(ISERROR('Audit questions'!A29),\"\",'Audit questions'!A29)","v":"Test28"},"",{"$f":"'Nov-Data'!AC10","v":""},{"$f":"'Nov-Data'!AC12","v":""},{"$f":"'Nov-Data'!AC11","v":""},0]
[{"$f":"IF(ISERROR('Audit questions'!A30),\"\",'Audit questions'!A30)","v":"Test29"},"",{"$f":"'Nov-Data'!AD10","v":""},{"$f":"'Nov-Data'!AD12","v":""},{"$f":"'Nov-Data'!AD11","v":""},0]
[{"$f":"IF(ISERROR('Audit questions'!A31),\"\",'Audit questions'!A31)","v":"Test30"},"",{"$f":"'Nov-Data'!AE10","v":""},{"$f":"'Nov-Data'!AE12","v":""},{"$f":"'Nov-Data'!AE11","v":""},0]
[{"$f":"IF(ISERROR('Audit questions'!A32),\"\",'Audit questions'!A32)","v":"Test31"},"",{"$f":"'Nov-Data'!AF10","v":""},{"$f":"'Nov-Data'!AF12","v":""},{"$f":"'Nov-Data'!AF11","v":""},0]
[{"$f":"IF(ISERROR('Audit questions'!A33),\"\",'Audit questions'!A33)","v":"Test32"},"",{"$f":"'Nov-Data'!AG10","v":""},{"$f":"'Nov-Data'!AG12","v":""},{"$f":"'Nov-Data'!AG11","v":""},0]
[{"$f":"IF(ISERROR('Audit questions'!A34),\"\",'Audit questions'!A34)","v":"Test33"},"",{"$f":"'Nov-Data'!AH10","v":""},{"$f":"'Nov-Data'!AH12","v":""},{"$f":"'Nov-Data'!AH11","v":""},0]
[{"$f":"IF(ISERROR('Audit questions'!A35),\"\",'Audit questions'!A35)","v":"Test34"},"",{"$f":"'Nov-Data'!AI10","v":""},{"$f":"'Nov-Data'!AI12","v":""},{"$f":"'Nov-Data'!AI11","v":""},0]
[{"$f":"IF(ISERROR('Audit questions'!A36),\"\",'Audit questions'!A36)","v":"Test35"},"",{"$f":"'Nov-Data'!AJ10","v":""},{"$f":"'Nov-Data'!AJ12","v":""},{"$f":"'Nov-Data'!AJ11","v":""},0]
[{"$f":"IF(ISERROR('Audit questions'!A37),\"\",'Audit questions'!A37)","v":"Test36"},"",{"$f":"'Nov-Data'!AK10","v":""},{"$f":"'Nov-Data'!AK12","v":""},{"$f":"'Nov-Data'!AK11","v":""},0]
[{"$f":"IF(ISERROR('Audit questions'!A38),\"\",'Audit questions'!A38)","v":"Test37"},"",{"$f":"'Nov-Data'!AL10","v":""},{"$f":"'Nov-Data'!AL12","v":""},{"$f":"'Nov-Data'!AL11","v":""},0]
[{"$f":"IF(ISERROR('Audit questions'!A39),\"\",'Audit questions'!A39)","v":"Test38"},"",{"$f":"'Nov-Data'!AM10","v":""},{"$f":"'Nov-Data'!AM12","v":""},{"$f":"'Nov-Data'!AM11","v":""},0]
[{"$f":"IF(ISERROR('Audit questions'!A40),\"\",'Audit questions'!A40)","v":"Test39"},"",{"$f":"'Nov-Data'!AN10","v":""},{"$f":"'Nov-Data'!AN12","v":""},{"$f":"'Nov-Data'!AN11","v":""},0]
[{"$f":"IF(ISERROR('Audit questions'!A41),\"\",'Audit questions'!A41)","v":"Test40"},"",{"$f":"'Nov-Data'!AO10","v":""},{"$f":"'Nov-Data'!AO12","v":""},{"$f":"'Nov-Data'!AO11","v":""},0]
[null,null,null,null,null,null,{"$f":"COUNTIF(F11:F50,\">=1\")","v":0}]

{"sheet":"Nov-Raw","index":28,"n_rows":2,"n_cols":87,"rows_kept":2,"cut":false,"hidden":true,"merged":[[0,85,0,86],[0,63,0,64],[0,65,0,66],[0,67,0,68],[0,69,0,70],[0,71,0,72],[0,73,0,74],[0,75,0,76],[0,77,0,78],[0,79,0,80],[0,81,0,82],[0,83,0,84],[0,61,0,62],[0,39,0,40],[0,41,0,42],[0,43,0,44],[0,45,0,46],[0,47,0,48],[0,49,0,50],[0,51,0,52],[0,53,0,54],[0,55,0,56],[0,57,0,58],[0,59,0,60],[0,37,0,38],[0,15,0,16],[0,17,0,18],[0,19,0,20],[0,21,0,22],[0,23,0,24],[0,25,0,26],[0,27,0,28],[0,29,0,30],[0,31,0,32],[0,33,0,34],[0,35,0,36],[0,13,0,14],[0,0,0,5],[0,6,1,6],[0,7,0,8],[0,9,0,10],[0,11,0,12]]}
["Record details",null,null,null,null,null,"Notes",{"$f":"'Audit questions'!A2","v":"Test1"},null,{"$f":"'Audit questions'!A3","v":"Test2"},null,{"$f":"'Audit questions'!A4","v":"Test3"},null,{"$f":"'Audit questions'!A5","v":"Test4"},null,{"$f":"'Audit questions'!A6","v":"Test5"},null,{"$f":"'Audit questions'!A7","v":"Test6"},null,{"$f":"'Audit questions'!A8","v":"Test7"},null,{"$f":"'Audit questions'!A9","v":"Test8"},null,{"$f":"'Audit questions'!A10","v":"Test9"},null,{"$f":"'Audit questions'!A11","v":"Test10"},null,{"$f":"'Audit questions'!A12","v":"Test11"},null,{"$f":"'Audit questions'!A13","v":"Test12"},null,{"$f":"'Audit questions'!A14","v":"Test13"},null,{"$f":"'Audit questions'!A15","v":"Test14"},null,{"$f":"'Audit questions'!A16","v":"Test15"},null,{"$f":"'Audit questions'!A17","v":"Test16"},null,{"$f":"'Audit questions'!A18","v":"Test17"},null,{"$f":"'Audit questions'!A19","v":"Test18"},null,{"$f":"'Audit questions'!A20","v":"Test19"},null,{"$f":"'Audit questions'!A21","v":"Test20"},null,{"$f":"'Audit questions'!A22","v":"Test21"},null,{"$f":"'Audit questions'!A23","v":"Test22"},null,{"$f":"'Audit questions'!A24","v":"Test23"},null,{"$f":"'Audit questions'!A25","v":"Test24"},null,{"$f":"'Audit questions'!A26","v":"Test25"},null,{"$f":"'Audit questions'!A27","v":"Test26"},null,{"$f":"'Audit questions'!A28","v":"Test27"},null,{"$f":"'Audit questions'!A29","v":"Test28"},null,{"$f":"'Audit questions'!A30","v":"Test29"},null,{"$f":"'Audit questions'!A31","v":"Test30"},null,{"$f":"'Audit questions'!A32","v":"Test31"},null,{"$f":"'Audit questions'!A33","v":"Test32"},null,{"$f":"'Audit questions'!A34","v":"Test33"},null,{"$f":"'Audit questions'!A35","v":"Test34"},null,{"$f":"'Audit questions'!A36","v":"Test35"},null,{"$f":"'Audit questions'!A37","v":"Test36"},null,{"$f":"'Audit questions'!A38","v":"Test37"},null,{"$f":"'Audit questions'!A39","v":"Test38"},null,{"$f":"'Audit questions'!A40","v":"Test39"},null,{"$f":"'Audit questions'!A41","v":"Test40"}]
["Pt number","Date seen","Clinician 1","clinician 2","New/ F-up","Apt code",null,"Compliant?","Other result","Compliant?","Other result","Compliant?","Other result","Compliant?","Other result","Compliant?","Other result","Compliant?","Other result","Compliant?","Other result","Compliant?","Other result","Compliant?","Other result","Compliant?","Other result","Compliant?","Other result","Compliant?","Other result","Compliant?","Other result","Compliant?","Other result","Compliant?","Other result","Compliant?","Other result","Compliant?","Other result","Compliant?","Other result","Compliant?","Other result","Compliant?","Other result","Compliant?","Other result","Compliant?","Other result","Compliant?","Other result","Compliant?","Other result","Compliant?","Other result","Compliant?","Other result","Compliant?","Other result","Compliant?","Other result","Compliant?","Other result","Compliant?","Other result","Compliant?","Other result","Compliant?","Other result","Compliant?","Other result","Compliant?","Other result","Compliant?","Other result","Compliant?","Other result","Compliant?","Other result","Compliant?","Other result","Compliant?","Other result","Compliant?","Other result"]

{"sheet":"Nov-Data","index":29,"n_rows":12,"n_cols":41,"rows_kept":12,"cut":false,"hidden":true,"merged":[[0,0,1,0]]}
["Results",{"$f":"'Audit questions'!A2","v":"Test1"},{"$f":"'Audit questions'!A3","v":"Test2"},{"$f":"'Audit questions'!A4","v":"Test3"},{"$f":"'Audit questions'!A5","v":"Test4"},{"$f":"'Audit questions'!A6","v":"Test5"},{"$f":"'Audit questions'!A7","v":"Test6"},{"$f":"'Audit questions'!A8","v":"Test7"},{"$f":"'Audit questions'!A9","v":"Test8"},{"$f":"'Audit questions'!A10","v":"Test9"},{"$f":"'Audit questions'!A11","v":"Test10"},{"$f":"'Audit questions'!A12","v":"Test11"},{"$f":"'Audit questions'!A13","v":"Test12"},{"$f":"'Audit questions'!A14","v":"Test13"},{"$f":"'Audit questions'!A15","v":"Test14"},{"$f":"'Audit questions'!A16","v":"Test15"},{"$f":"'Audit questions'!A17","v":"Test16"},{"$f":"'Audit questions'!A18","v":"Test17"},{"$f":"'Audit questions'!A19","v":"Test18"},{"$f":"'Audit questions'!A20","v":"Test19"},{"$f":"'Audit questions'!A21","v":"Test20"},{"$f":"'Audit questions'!A22","v":"Test21"},{"$f":"'Audit questions'!A23","v":"Test22"},{"$f":"'Audit questions'!A24","v":"Test23"},{"$f":"'Audit questions'!A25","v":"Test24"},{"$f":"'Audit questions'!A26","v":"Test25"},{"$f":"'Audit questions'!A27","v":"Test26"},{"$f":"'Audit questions'!A28","v":"Test27"},{"$f":"'Audit questions'!A29","v":"Test28"},{"$f":"'Audit questions'!A30","v":"Test29"},{"$f":"'Audit questions'!A31","v":"Test30"},{"$f":"'Audit questions'!A32","v":"Test31"},{"$f":"'Audit questions'!A33","v":"Test32"},{"$f":"'Audit questions'!A34","v":"Test33"},{"$f":"'Audit questions'!A35","v":"Test34"},{"$f":"'Audit questions'!A36","v":"Test35"},{"$f":"'Audit questions'!A37","v":"Test36"},{"$f":"'Audit questions'!A38","v":"Test37"},{"$f":"'Audit questions'!A39","v":"Test38"},{"$f":"'Audit questions'!A40","v":"Test39"},{"$f":"'Audit questions'!A41","v":"Test40"}]
[null,"Compliant?","Compliant?","Compliant?","Compliant?","Compliant?","Compliant?","Compliant?","Compliant?","Compliant?","Compliant?","Compliant?","Compliant?","Compliant?","Compliant?","Compliant?","Compliant?","Compliant?","Compliant?","Compliant?","Compliant?","Compliant?","Compliant?","Compliant?","Compliant?","Compliant?","Compliant?","Compliant?","Compliant?","Compliant?","Compliant?","Compliant?","Compliant?","Compliant?","Compliant?","Compliant?","Compliant?","Compliant?","Compliant?","Compliant?","Compliant?"]
["Total Y",{"$f":"COUNTIF('Nov-Raw'!H:H,\"yes\")","v":0},{"$f":"COUNTIF('Nov-Raw'!J:J,\"yes\")","v":0},{"$f":"COUNTIF('Nov-Raw'!L:L,\"yes\")","v":0},{"$f":"COUNTIF('Nov-Raw'!N:N,\"yes\")","v":0},{"$f":"COUNTIF('Nov-Raw'!P:P,\"yes\")","v":0},{"$f":"COUNTIF('Nov-Raw'!R:R,\"yes\")","v":0},{"$f":"COUNTIF('Nov-Raw'!T:T,\"yes\")","v":0},{"$f":"COUNTIF('Nov-Raw'!V:V,\"yes\")","v":0},{"$f":"COUNTIF('Nov-Raw'!X:X,\"yes\")","v":0},{"$f":"COUNTIF('Nov-Raw'!Z:Z,\"yes\")","v":0},{"$f":"COUNTIF('Nov-Raw'!AB:AB,\"yes\")","v":0},{"$f":"COUNTIF('Nov-Raw'!AD:AD,\"yes\")","v":0},{"$f":"COUNTIF('Nov-Raw'!AF:AF,\"yes\")","v":0},{"$f":"COUNTIF('Nov-Raw'!AH:AH,\"yes\")","v":0},{"$f":"COUNTIF('Nov-Raw'!AJ:AJ,\"yes\")","v":0},{"$f":"COUNTIF('Nov-Raw'!AL:AL,\"yes\")","v":0},{"$f":"COUNTIF('Nov-Raw'!AN:AN,\"yes\")","v":0},{"$f":"COUNTIF('Nov-Raw'!AP:AP,\"yes\")","v":0},{"$f":"COUNTIF('Nov-Raw'!AR:AR,\"yes\")","v":0},{"$f":"COUNTIF('Nov-Raw'!AT:AT,\"yes\")","v":0},{"$f":"COUNTIF('Nov-Raw'!AV:AV,\"yes\")","v":0},{"$f":"COUNTIF('Nov-Raw'!AX:AX,\"yes\")","v":0},{"$f":"COUNTIF('Nov-Raw'!AZ:AZ,\"yes\")","v":0},{"$f":"COUNTIF('Nov-Raw'!BB:BB,\"yes\")","v":0},{"$f":"COUNTIF('Nov-Raw'!BD:BD,\"yes\")","v":0},{"$f":"COUNTIF('Nov-Raw'!BF:BF,\"yes\")","v":0},{"$f":"COUNTIF('Nov-Raw'!BH:BH,\"yes\")","v":0},{"$f":"COUNTIF('Nov-Raw'!BJ:BJ,\"yes\")","v":0},{"$f":"COUNTIF('Nov-Raw'!BL:BL,\"yes\")","v":0},{"$f":"COUNTIF('Nov-Raw'!BN:BN,\"yes\")","v":0},{"$f":"COUNTIF('Nov-Raw'!BP:BP,\"yes\")","v":0},{"$f":"COUNTIF('Nov-Raw'!BR:BR,\"yes\")","v":0},{"$f":"COUNTIF('Nov-Raw'!BT:BT,\"yes\")","v":0},{"$f":"COUNTIF('Nov-Raw'!BV:BV,\"yes\")","v":0},{"$f":"COUNTIF('Nov-Raw'!BX:BX,\"yes\")","v":0},{"$f":"COUNTIF('Nov-Raw'!BZ:BZ,\"yes\")","v":0},{"$f":"COUNTIF('Nov-Raw'!CB:CB,\"yes\")","v":0},{"$f":"COUNTIF('Nov-Raw'!CD:CD,\"yes\")","v":0},{"$f":"COUNTIF('Nov-Raw'!CF:CF,\"yes\")","v":0},{"$f":"COUNTIF('Nov-Raw'!CH:CH,\"yes\")","v":0}]
["Total N",{"$f":"COUNTIF('Nov-Raw'!H:H,\"no\")","v":0},{"$f":"COUNTIF('Nov-Raw'!J:J,\"no\")","v":0},{"$f":"COUNTIF('Nov-Raw'!L:L,\"no\")","v":0},{"$f":"COUNTIF('Nov-Raw'!N:N,\"no\")","v":0},{"$f":"COUNTIF('Nov-Raw'!P:P,\"no\")","v":0},{"$f":"COUNTIF('Nov-Raw'!R:R,\"no\")","v":0},{"$f":"COUNTIF('Nov-Raw'!T:T,\"no\")","v":0},{"$f":"COUNTIF('Nov-Raw'!V:V,\"no\")","v":0},{"$f":"COUNTIF('Nov-Raw'!X:X,\"no\")","v":0},{"$f":"COUNTIF('Nov-Raw'!Z:Z,\"no\")","v":0},{"$f":"COUNTIF('Nov-Raw'!AB:AB,\"no\")","v":0},{"$f":"COUNTIF('Nov-Raw'!AD:AD,\"no\")","v":0},{"$f":"COUNTIF('Nov-Raw'!AF:AF,\"no\")","v":0},{"$f":"COUNTIF('Nov-Raw'!AH:AH,\"no\")","v":0},{"$f":"COUNTIF('Nov-Raw'!AJ:AJ,\"no\")","v":0},{"$f":"COUNTIF('Nov-Raw'!AL:AL,\"no\")","v":0},{"$f":"COUNTIF('Nov-Raw'!AN:AN,\"no\")","v":0},{"$f":"COUNTIF('Nov-Raw'!AP:AP,\"no\")","v":0},{"$f":"COUNTIF('Nov-Raw'!AR:AR,\"no\")","v":0},{"$f":"COUNTIF('Nov-Raw'!AT:AT,\"no\")","v":0},{"$f":"COUNTIF('Nov-Raw'!AV:AV,\"no\")","v":0},{"$f":"COUNTIF('Nov-Raw'!AX:AX,\"no\")","v":0},{"$f":"COUNTIF('Nov-Raw'!AZ:AZ,\"no\")","v":0},{"$f":"COUNTIF('Nov-Raw'!BB:BB,\"no\")","v":0},{"$f":"COUNTIF('Nov-Raw'!BD:BD,\"no\")","v":0},{"$f":"COUNTIF('Nov-Raw'!BF:BF,\"no\")","v":0},{"$f":"COUNTIF('Nov-Raw'!BH:BH,\"no\")","v":0},{"$f":"COUNTIF('Nov-Raw'!BJ:BJ,\"no\")","v":0},{"$f":"COUNTIF('Nov-Raw'!BL:BL,\"no\")","v":0},{"$f":"COUNTIF('Nov-Raw'!BN:BN,\"no\")","v":0},{"$f":"COUNTIF('Nov-Raw'!BP:BP,\"no\")","v":0},{"$f":"COUNTIF('Nov-Raw'!BR:BR,\"no\")","v":0},{"$f":"COUNTIF('Nov-Raw'!BT:BT,\"no\")","v":0},{"$f":"COUNTIF('Nov-Raw'!BV:BV,\"no\")","v":0},{"$f":"COUNTIF('Nov-Raw'!BX:BX,\"no\")","v":0},{"$f":"COUNTIF('Nov-Raw'!BZ:BZ,\"no\")","v":0},{"$f":"COUNTIF('Nov-Raw'!CB:CB,\"no\")","v":0},{"$f":"COUNTIF('Nov-Raw'!CD:CD,\"no\")","v":0},{"$f":"COUNTIF('Nov-Raw'!CF:CF,\"no\")","v":0},{"$f":"COUNTIF('Nov-Raw'!CH:CH,\"no\")","v":0}]
["Total Justified",{"$f":"COUNTIF('Nov-Raw'!H:H,\"Justified\")","v":0},{"$f":"COUNTIF('Nov-Raw'!J:J,\"Justified\")","v":0},{"$f":"COUNTIF('Nov-Raw'!L:L,\"Justified\")","v":0},{"$f":"COUNTIF('Nov-Raw'!N:N,\"Justified\")","v":0},{"$f":"COUNTIF('Nov-Raw'!P:P,\"Justified\")","v":0},{"$f":"COUNTIF('Nov-Raw'!R:R,\"Justified\")","v":0},{"$f":"COUNTIF('Nov-Raw'!T:T,\"Justified\")","v":0},{"$f":"COUNTIF('Nov-Raw'!V:V,\"Justified\")","v":0},{"$f":"COUNTIF('Nov-Raw'!X:X,\"Justified\")","v":0},{"$f":"COUNTIF('Nov-Raw'!Z:Z,\"Justified\")","v":0},{"$f":"COUNTIF('Nov-Raw'!AB:AB,\"Justified\")","v":0},{"$f":"COUNTIF('Nov-Raw'!AD:AD,\"Justified\")","v":0},{"$f":"COUNTIF('Nov-Raw'!AF:AF,\"Justified\")","v":0},{"$f":"COUNTIF('Nov-Raw'!AH:AH,\"Justified\")","v":0},{"$f":"COUNTIF('Nov-Raw'!AJ:AJ,\"Justified\")","v":0},{"$f":"COUNTIF('Nov-Raw'!AL:AL,\"Justified\")","v":0},{"$f":"COUNTIF('Nov-Raw'!AN:AN,\"Justified\")","v":0},{"$f":"COUNTIF('Nov-Raw'!AP:AP,\"Justified\")","v":0},{"$f":"COUNTIF('Nov-Raw'!AR:AR,\"Justified\")","v":0},{"$f":"COUNTIF('Nov-Raw'!AT:AT,\"Justified\")","v":0},{"$f":"COUNTIF('Nov-Raw'!AV:AV,\"Justified\")","v":0},{"$f":"COUNTIF('Nov-Raw'!AX:AX,\"Justified\")","v":0},{"$f":"COUNTIF('Nov-Raw'!AZ:AZ,\"Justified\")","v":0},{"$f":"COUNTIF('Nov-Raw'!BB:BB,\"Justified\")","v":0},{"$f":"COUNTIF('Nov-Raw'!BD:BD,\"Justified\")","v":0},{"$f":"COUNTIF('Nov-Raw'!BF:BF,\"Justified\")","v":0},{"$f":"COUNTIF('Nov-Raw'!BH:BH,\"Justified\")","v":0},{"$f":"COUNTIF('Nov-Raw'!BJ:BJ,\"Justified\")","v":0},{"$f":"COUNTIF('Nov-Raw'!BL:BL,\"Justified\")","v":0},{"$f":"COUNTIF('Nov-Raw'!BN:BN,\"Justified\")","v":0},{"$f":"COUNTIF('Nov-Raw'!BP:BP,\"Justified\")","v":0},{"$f":"COUNTIF('Nov-Raw'!BR:BR,\"Justified\")","v":0},{"$f":"COUNTIF('Nov-Raw'!BT:BT,\"Justified\")","v":0},{"$f":"COUNTIF('Nov-Raw'!BV:BV,\"Justified\")","v":0},{"$f":"COUNTIF('Nov-Raw'!BX:BX,\"Justified\")","v":0},{"$f":"COUNTIF('Nov-Raw'!BZ:BZ,\"Justified\")","v":0},{"$f":"COUNTIF('Nov-Raw'!CB:CB,\"Justified\")","v":0},{"$f":"COUNTIF('Nov-Raw'!CD:CD,\"Justified\")","v":0},{"$f":"COUNTIF('Nov-Raw'!CF:CF,\"Justified\")","v":0},{"$f":"COUNTIF('Nov-Raw'!CH:CH,\"Justified\")","v":0}]
["Total NA",{"$f":"COUNTIF('Nov-Raw'!H:H,\"NA\")","v":0},{"$f":"COUNTIF('Nov-Raw'!J:J,\"NA\")","v":0},{"$f":"COUNTIF('Nov-Raw'!L:L,\"NA\")","v":0},{"$f":"COUNTIF('Nov-Raw'!N:N,\"NA\")","v":0},{"$f":"COUNTIF('Nov-Raw'!P:P,\"NA\")","v":0},{"$f":"COUNTIF('Nov-Raw'!R:R,\"NA\")","v":0},{"$f":"COUNTIF('Nov-Raw'!T:T,\"NA\")","v":0},{"$f":"COUNTIF('Nov-Raw'!V:V,\"NA\")","v":0},{"$f":"COUNTIF('Nov-Raw'!X:X,\"NA\")","v":0},{"$f":"COUNTIF('Nov-Raw'!Z:Z,\"NA\")","v":0},{"$f":"COUNTIF('Nov-Raw'!AB:AB,\"NA\")","v":0},{"$f":"COUNTIF('Nov-Raw'!AD:AD,\"NA\")","v":0},{"$f":"COUNTIF('Nov-Raw'!AF:AF,\"NA\")","v":0},{"$f":"COUNTIF('Nov-Raw'!AH:AH,\"NA\")","v":0},{"$f":"COUNTIF('Nov-Raw'!AJ:AJ,\"NA\")","v":0},{"$f":"COUNTIF('Nov-Raw'!AL:AL,\"NA\")","v":0},{"$f":"COUNTIF('Nov-Raw'!AN:AN,\"NA\")","v":0},{"$f":"COUNTIF('Nov-Raw'!AP:AP,\"NA\")","v":0},{"$f":"COUNTIF('Nov-Raw'!AR:AR,\"NA\")","v":0},{"$f":"COUNTIF('Nov-Raw'!AT:AT,\"NA\")","v":0},{"$f":"COUNTIF('Nov-Raw'!AV:AV,\"NA\")","v":0},{"$f":"COUNTIF('Nov-Raw'!AX:AX,\"NA\")","v":0},{"$f":"COUNTIF('Nov-Raw'!AZ:AZ,\"NA\")","v":0},{"$f":"COUNTIF('Nov-Raw'!BB:BB,\"NA\")","v":0},{"$f":"COUNTIF('Nov-Raw'!BD:BD,\"NA\")","v":0},{"$f":"COUNTIF('Nov-Raw'!BF:BF,\"NA\")","v":0},{"$f":"COUNTIF('Nov-Raw'!BH:BH,\"NA\")","v":0},{"$f":"COUNTIF('Nov-Raw'!BJ:BJ,\"NA\")","v":0},{"$f":"COUNTIF('Nov-Raw'!BL:BL,\"NA\")","v":0},{"$f":"COUNTIF('Nov-Raw'!BN:BN,\"NA\")","v":0},{"$f":"COUNTIF('Nov-Raw'!BP:BP,\"NA\")","v":0},{"$f":"COUNTIF('Nov-Raw'!BR:BR,\"NA\")","v":0},{"$f":"COUNTIF('Nov-Raw'!BT:BT,\"NA\")","v":0},{"$f":"COUNTIF('Nov-Raw'!BV:BV,\"NA\")","v":0},{"$f":"COUNTIF('Nov-Raw'!BX:BX,\"NA\")","v":0},{"$f":"COUNTIF('Nov-Raw'!BZ:BZ,\"NA\")","v":0},{"$f":"COUNTIF('Nov-Raw'!CB:CB,\"NA\")","v":0},{"$f":"COUNTIF('Nov-Raw'!CD:CD,\"NA\")","v":0},{"$f":"COUNTIF('Nov-Raw'!CF:CF,\"NA\")","v":0},{"$f":"COUNTIF('Nov-Raw'!CH:CH,\"NA\")","v":0}]
["Blanks",{"$f":"B8-(SUM(B3:B6))","v":0},{"$f":"C8-(SUM(C3:C6))","v":0},0,0,0,0,0,0,0,0,0,0,0,0,0,0,0,0,0,0,0,0,0,0,0,0,0,0,0,0,0,0,0,0,0,0,0,0,0,0]
["full sample size",{"$f":"COUNTA('Nov-Raw'!A:A)-2","v":0},{"$f":"B8","v":0},0,0,0,0,0,0,0,0,0,0,0,0,0,0,0,0,0,0,0,0,0,0,0,0,0,0,0,0,0,0,0,0,0,0,0,0,0,0]
["True sample size (-NA + blanks)",{"$f":"IF(ISERROR(B8-(B6+B7)),\"\",B8-(B6+B7))","v":0},{"$f":"IF(ISERROR(C8-(C6+C7)),\"\",C8-(C6+C7))","v":0},0,0,0,0,0,0,0,0,0,0,0,0,0,0,0,0,0,0,0,0,0,0,0,0,0,0,0,0,0,0,0,0,0,0,0,0,0,0]
["%Y",{"$f":"IF(ISERROR(B3/B9),\"\",B3/B9)","v":""},{"$f":"IF(ISERROR(C3/C9),\"\",C3/C9)","v":""},"","","","","","","","","","","","","","","","","","","","","","","","","","","","","","","","","","","","","",""]
["%N",{"$f":"IF(ISERROR(B4/B9),\"\",B4/B9)","v":""},{"$f":"IF(ISERROR(C4/C9),\"\",C4/C9)","v":""},"","","","","","","","","","","","","","","","","","","","","","","","","","","","","","","","","","","","","",""]
["%N - Justified",{"$f":"IF(ISERROR(B5/B9),\"\",B5/B9)","v":""},{"$f":"IF(ISERROR(C5/C9),\"\",C5/C9)","v":""},"","","","","","","","","","","","","","","","","","","","","","","","","","","","","","","","","","","","","",""]

{"sheet":"Dec","index":30,"n_rows":51,"n_cols":8,"rows_kept":51,"cut":false,"hidden":false,"merged":[]}
["Click here to go to year overview"]
[]
["Date",null,null,"Total by Apt type"]
["Completed by",null,null,"New",{"$f":"COUNTIF('Dec-Raw'!E3:E103,\"New\")","v":0}]
["Sample group size",{"$f":"COUNTA('Dec-Raw'!A:A)-2","v":0},null,"Follow up",{"$f":"COUNTIF('Dec-Raw'!E3:E103,\"Fup\")","v":0},null,null,{"$f":"Year!H5","v":0.95}]
["Overall Result (compliant only)",{"$f":"IF(ISERROR(SUM(C11:C50)/G51),\"\",SUM(C11:C50)/G51)","v":""},null,"Total by apt Code",null,null,null,{"$f":"Year!H6","v":"80-95%"}]
["Overall Result (compliant & Justified)",{"$f":"IF(ISERROR(SUM(B11:B50)/G51),\"\",SUM(B11:B50)/G51)","v":""},null,"code goes in here",{"$f":"COUNTIF('Dec-Raw'!F3:F103,D7)","v":0},null,null,{"$f":"Year!H7","v":0.8}]
["viable qs",{"$f":"G51","v":0}]
[]
["Metric","Compliant + Justified","Compliant","Justified","Not compliant","Irritating math"]
[{"$f":"IF(ISERROR('Audit questions'!A2),\"\",'Audit questions'!A2)","v":"Test1"},{"$f":"IF(ISERROR(C11+D11),\"\",C11+D11)","v":""},{"$f":"'Dec-Data'!B10","v":""},{"$f":"'Dec-Data'!B12","v":""},{"$f":"'Dec-Data'!B11","v":""},{"$f":"COUNTIF(C11:E11,\">0\")","v":0}]
[{"$f":"IF(ISERROR('Audit questions'!A3),\"\",'Audit questions'!A3)","v":"Test2"},"",{"$f":"'Dec-Data'!C10","v":""},{"$f":"'Dec-Data'!C12","v":""},{"$f":"'Dec-Data'!C11","v":""},0]
[{"$f":"IF(ISERROR('Audit questions'!A4),\"\",'Audit questions'!A4)","v":"Test3"},"",{"$f":"'Dec-Data'!D10","v":""},{"$f":"'Dec-Data'!D12","v":""},{"$f":"'Dec-Data'!D11","v":""},0]
[{"$f":"IF(ISERROR('Audit questions'!A5),\"\",'Audit questions'!A5)","v":"Test4"},"",{"$f":"'Dec-Data'!E10","v":""},{"$f":"'Dec-Data'!E12","v":""},{"$f":"'Dec-Data'!E11","v":""},0]
[{"$f":"IF(ISERROR('Audit questions'!A6),\"\",'Audit questions'!A6)","v":"Test5"},"",{"$f":"'Dec-Data'!F10","v":""},{"$f":"'Dec-Data'!F12","v":""},{"$f":"'Dec-Data'!F11","v":""},0]
[{"$f":"IF(ISERROR('Audit questions'!A7),\"\",'Audit questions'!A7)","v":"Test6"},"",{"$f":"'Dec-Data'!G10","v":""},{"$f":"'Dec-Data'!G12","v":""},{"$f":"'Dec-Data'!G11","v":""},0]
[{"$f":"IF(ISERROR('Audit questions'!A8),\"\",'Audit questions'!A8)","v":"Test7"},"",{"$f":"'Dec-Data'!H10","v":""},{"$f":"'Dec-Data'!H12","v":""},{"$f":"'Dec-Data'!H11","v":""},0]
[{"$f":"IF(ISERROR('Audit questions'!A9),\"\",'Audit questions'!A9)","v":"Test8"},"",{"$f":"'Dec-Data'!I10","v":""},{"$f":"'Dec-Data'!I12","v":""},{"$f":"'Dec-Data'!I11","v":""},0]
[{"$f":"IF(ISERROR('Audit questions'!A10),\"\",'Audit questions'!A10)","v":"Test9"},"",{"$f":"'Dec-Data'!J10","v":""},{"$f":"'Dec-Data'!J12","v":""},{"$f":"'Dec-Data'!J11","v":""},0]
[{"$f":"IF(ISERROR('Audit questions'!A11),\"\",'Audit questions'!A11)","v":"Test10"},"",{"$f":"'Dec-Data'!K10","v":""},{"$f":"'Dec-Data'!K12","v":""},{"$f":"'Dec-Data'!K11","v":""},0]
[{"$f":"IF(ISERROR('Audit questions'!A12),\"\",'Audit questions'!A12)","v":"Test11"},"",{"$f":"'Dec-Data'!L10","v":""},{"$f":"'Dec-Data'!L12","v":""},{"$f":"'Dec-Data'!L11","v":""},0]
[{"$f":"IF(ISERROR('Audit questions'!A13),\"\",'Audit questions'!A13)","v":"Test12"},"",{"$f":"'Dec-Data'!M10","v":""},{"$f":"'Dec-Data'!M12","v":""},{"$f":"'Dec-Data'!M11","v":""},0]
[{"$f":"IF(ISERROR('Audit questions'!A14),\"\",'Audit questions'!A14)","v":"Test13"},"",{"$f":"'Dec-Data'!N10","v":""},{"$f":"'Dec-Data'!N12","v":""},{"$f":"'Dec-Data'!N11","v":""},0]
[{"$f":"IF(ISERROR('Audit questions'!A15),\"\",'Audit questions'!A15)","v":"Test14"},"",{"$f":"'Dec-Data'!O10","v":""},{"$f":"'Dec-Data'!O12","v":""},{"$f":"'Dec-Data'!O11","v":""},0]
[{"$f":"IF(ISERROR('Audit questions'!A16),\"\",'Audit questions'!A16)","v":"Test15"},"",{"$f":"'Dec-Data'!P10","v":""},{"$f":"'Dec-Data'!P12","v":""},{"$f":"'Dec-Data'!P11","v":""},0]
[{"$f":"IF(ISERROR('Audit questions'!A17),\"\",'Audit questions'!A17)","v":"Test16"},"",{"$f":"'Dec-Data'!Q10","v":""},{"$f":"'Dec-Data'!Q12","v":""},{"$f":"'Dec-Data'!Q11","v":""},0]
[{"$f":"IF(ISERROR('Audit questions'!A18),\"\",'Audit questions'!A18)","v":"Test17"},"",{"$f":"'Dec-Data'!R10","v":""},{"$f":"'Dec-Data'!R12","v":""},{"$f":"'Dec-Data'!R11","v":""},0]
[{"$f":"IF(ISERROR('Audit questions'!A19),\"\",'Audit questions'!A19)","v":"Test18"},"",{"$f":"'Dec-Data'!S10","v":""},{"$f":"'Dec-Data'!S12","v":""},{"$f":"'Dec-Data'!S11","v":""},0]
[{"$f":"IF(ISERROR('Audit questions'!A20),\"\",'Audit questions'!A20)","v":"Test19"},"",{"$f":"'Dec-Data'!T10","v":""},{"$f":"'Dec-Data'!T12","v":""},{"$f":"'Dec-Data'!T11","v":""},0]
[{"$f":"IF(ISERROR('Audit questions'!A21),\"\",'Audit questions'!A21)","v":"Test20"},"",{"$f":"'Dec-Data'!U10","v":""},{"$f":"'Dec-Data'!U12","v":""},{"$f":"'Dec-Data'!U11","v":""},0]
[{"$f":"IF(ISERROR('Audit questions'!A22),\"\",'Audit questions'!A22)","v":"Test21"},"",{"$f":"'Dec-Data'!V10","v":""},{"$f":"'Dec-Data'!V12","v":""},{"$f":"'Dec-Data'!V11","v":""},0]
[{"$f":"IF(ISERROR('Audit questions'!A23),\"\",'Audit questions'!A23)","v":"Test22"},"",{"$f":"'Dec-Data'!W10","v":""},{"$f":"'Dec-Data'!W12","v":""},{"$f":"'Dec-Data'!W11","v":""},0]
[{"$f":"IF(ISERROR('Audit questions'!A24),\"\",'Audit questions'!A24)","v":"Test23"},"",{"$f":"'Dec-Data'!X10","v":""},{"$f":"'Dec-Data'!X12","v":""},{"$f":"'Dec-Data'!X11","v":""},0]
[{"$f":"IF(ISERROR('Audit questions'!A25),\"\",'Audit questions'!A25)","v":"Test24"},"",{"$f":"'Dec-Data'!Y10","v":""},{"$f":"'Dec-Data'!Y12","v":""},{"$f":"'Dec-Data'!Y11","v":""},0]
[{"$f":"IF(ISERROR('Audit questions'!A26),\"\",'Audit questions'!A26)","v":"Test25"},"",{"$f":"'Dec-Data'!Z10","v":""},{"$f":"'Dec-Data'!Z12","v":""},{"$f":"'Dec-Data'!Z11","v":""},0]
[{"$f":"IF(ISERROR('Audit questions'!A27),\"\",'Audit questions'!A27)","v":"Test26"},"",{"$f":"'Dec-Data'!AA10","v":""},{"$f":"'Dec-Data'!AA12","v":""},{"$f":"'Dec-Data'!AA11","v":""},0]
[{"$f":"IF(ISERROR('Audit questions'!A28),\"\",'Audit questions'!A28)","v":"Test27"},"",{"$f":"'Dec-Data'!AB10","v":""},{"$f":"'Dec-Data'!AB12","v":""},{"$f":"'Dec-Data'!AB11","v":""},0]
[{"$f":"IF(ISERROR('Audit questions'!A29),\"\",'Audit questions'!A29)","v":"Test28"},"",{"$f":"'Dec-Data'!AC10","v":""},{"$f":"'Dec-Data'!AC12","v":""},{"$f":"'Dec-Data'!AC11","v":""},0]
[{"$f":"IF(ISERROR('Audit questions'!A30),\"\",'Audit questions'!A30)","v":"Test29"},"",{"$f":"'Dec-Data'!AD10","v":""},{"$f":"'Dec-Data'!AD12","v":""},{"$f":"'Dec-Data'!AD11","v":""},0]
[{"$f":"IF(ISERROR('Audit questions'!A31),\"\",'Audit questions'!A31)","v":"Test30"},"",{"$f":"'Dec-Data'!AE10","v":""},{"$f":"'Dec-Data'!AE12","v":""},{"$f":"'Dec-Data'!AE11","v":""},0]
[{"$f":"IF(ISERROR('Audit questions'!A32),\"\",'Audit questions'!A32)","v":"Test31"},"",{"$f":"'Dec-Data'!AF10","v":""},{"$f":"'Dec-Data'!AF12","v":""},{"$f":"'Dec-Data'!AF11","v":""},0]
[{"$f":"IF(ISERROR('Audit questions'!A33),\"\",'Audit questions'!A33)","v":"Test32"},"",{"$f":"'Dec-Data'!AG10","v":""},{"$f":"'Dec-Data'!AG12","v":""},{"$f":"'Dec-Data'!AG11","v":""},0]
[{"$f":"IF(ISERROR('Audit questions'!A34),\"\",'Audit questions'!A34)","v":"Test33"},"",{"$f":"'Dec-Data'!AH10","v":""},{"$f":"'Dec-Data'!AH12","v":""},{"$f":"'Dec-Data'!AH11","v":""},0]
[{"$f":"IF(ISERROR('Audit questions'!A35),\"\",'Audit questions'!A35)","v":"Test34"},"",{"$f":"'Dec-Data'!AI10","v":""},{"$f":"'Dec-Data'!AI12","v":""},{"$f":"'Dec-Data'!AI11","v":""},0]
[{"$f":"IF(ISERROR('Audit questions'!A36),\"\",'Audit questions'!A36)","v":"Test35"},"",{"$f":"'Dec-Data'!AJ10","v":""},{"$f":"'Dec-Data'!AJ12","v":""},{"$f":"'Dec-Data'!AJ11","v":""},0]
[{"$f":"IF(ISERROR('Audit questions'!A37),\"\",'Audit questions'!A37)","v":"Test36"},"",{"$f":"'Dec-Data'!AK10","v":""},{"$f":"'Dec-Data'!AK12","v":""},{"$f":"'Dec-Data'!AK11","v":""},0]
[{"$f":"IF(ISERROR('Audit questions'!A38),\"\",'Audit questions'!A38)","v":"Test37"},"",{"$f":"'Dec-Data'!AL10","v":""},{"$f":"'Dec-Data'!AL12","v":""},{"$f":"'Dec-Data'!AL11","v":""},0]
[{"$f":"IF(ISERROR('Audit questions'!A39),\"\",'Audit questions'!A39)","v":"Test38"},"",{"$f":"'Dec-Data'!AM10","v":""},{"$f":"'Dec-Data'!AM12","v":""},{"$f":"'Dec-Data'!AM11","v":""},0]
[{"$f":"IF(ISERROR('Audit questions'!A40),\"\",'Audit questions'!A40)","v":"Test39"},"",{"$f":"'Dec-Data'!AN10","v":""},{"$f":"'Dec-Data'!AN12","v":""},{"$f":"'Dec-Data'!AN11","v":""},0]
[{"$f":"IF(ISERROR('Audit questions'!A41),\"\",'Audit questions'!A41)","v":"Test40"},"",{"$f":"'Dec-Data'!AO10","v":""},{"$f":"'Dec-Data'!AO12","v":""},{"$f":"'Dec-Data'!AO11","v":""},0]
[null,null,null,null,null,null,{"$f":"COUNTIF(F11:F50,\">=1\")","v":0}]

{"sheet":"Dec-Raw","index":31,"n_rows":2,"n_cols":87,"rows_kept":2,"cut":false,"hidden":true,"merged":[[0,85,0,86],[0,63,0,64],[0,65,0,66],[0,67,0,68],[0,69,0,70],[0,71,0,72],[0,73,0,74],[0,75,0,76],[0,77,0,78],[0,79,0,80],[0,81,0,82],[0,83,0,84],[0,61,0,62],[0,39,0,40],[0,41,0,42],[0,43,0,44],[0,45,0,46],[0,47,0,48],[0,49,0,50],[0,51,0,52],[0,53,0,54],[0,55,0,56],[0,57,0,58],[0,59,0,60],[0,37,0,38],[0,15,0,16],[0,17,0,18],[0,19,0,20],[0,21,0,22],[0,23,0,24],[0,25,0,26],[0,27,0,28],[0,29,0,30],[0,31,0,32],[0,33,0,34],[0,35,0,36],[0,13,0,14],[0,0,0,5],[0,6,1,6],[0,7,0,8],[0,9,0,10],[0,11,0,12]]}
["Record details",null,null,null,null,null,"Notes",{"$f":"'Audit questions'!A2","v":"Test1"},null,{"$f":"'Audit questions'!A3","v":"Test2"},null,{"$f":"'Audit questions'!A4","v":"Test3"},null,{"$f":"'Audit questions'!A5","v":"Test4"},null,{"$f":"'Audit questions'!A6","v":"Test5"},null,{"$f":"'Audit questions'!A7","v":"Test6"},null,{"$f":"'Audit questions'!A8","v":"Test7"},null,{"$f":"'Audit questions'!A9","v":"Test8"},null,{"$f":"'Audit questions'!A10","v":"Test9"},null,{"$f":"'Audit questions'!A11","v":"Test10"},null,{"$f":"'Audit questions'!A12","v":"Test11"},null,{"$f":"'Audit questions'!A13","v":"Test12"},null,{"$f":"'Audit questions'!A14","v":"Test13"},null,{"$f":"'Audit questions'!A15","v":"Test14"},null,{"$f":"'Audit questions'!A16","v":"Test15"},null,{"$f":"'Audit questions'!A17","v":"Test16"},null,{"$f":"'Audit questions'!A18","v":"Test17"},null,{"$f":"'Audit questions'!A19","v":"Test18"},null,{"$f":"'Audit questions'!A20","v":"Test19"},null,{"$f":"'Audit questions'!A21","v":"Test20"},null,{"$f":"'Audit questions'!A22","v":"Test21"},null,{"$f":"'Audit questions'!A23","v":"Test22"},null,{"$f":"'Audit questions'!A24","v":"Test23"},null,{"$f":"'Audit questions'!A25","v":"Test24"},null,{"$f":"'Audit questions'!A26","v":"Test25"},null,{"$f":"'Audit questions'!A27","v":"Test26"},null,{"$f":"'Audit questions'!A28","v":"Test27"},null,{"$f":"'Audit questions'!A29","v":"Test28"},null,{"$f":"'Audit questions'!A30","v":"Test29"},null,{"$f":"'Audit questions'!A31","v":"Test30"},null,{"$f":"'Audit questions'!A32","v":"Test31"},null,{"$f":"'Audit questions'!A33","v":"Test32"},null,{"$f":"'Audit questions'!A34","v":"Test33"},null,{"$f":"'Audit questions'!A35","v":"Test34"},null,{"$f":"'Audit questions'!A36","v":"Test35"},null,{"$f":"'Audit questions'!A37","v":"Test36"},null,{"$f":"'Audit questions'!A38","v":"Test37"},null,{"$f":"'Audit questions'!A39","v":"Test38"},null,{"$f":"'Audit questions'!A40","v":"Test39"},null,{"$f":"'Audit questions'!A41","v":"Test40"}]
["Pt number","Date seen","Clinician 1","clinician 2","New/ F-up","Apt code",null,"Compliant?","Other result","Compliant?","Other result","Compliant?","Other result","Compliant?","Other result","Compliant?","Other result","Compliant?","Other result","Compliant?","Other result","Compliant?","Other result","Compliant?","Other result","Compliant?","Other result","Compliant?","Other result","Compliant?","Other result","Compliant?","Other result","Compliant?","Other result","Compliant?","Other result","Compliant?","Other result","Compliant?","Other result","Compliant?","Other result","Compliant?","Other result","Compliant?","Other result","Compliant?","Other result","Compliant?","Other result","Compliant?","Other result","Compliant?","Other result","Compliant?","Other result","Compliant?","Other result","Compliant?","Other result","Compliant?","Other result","Compliant?","Other result","Compliant?","Other result","Compliant?","Other result","Compliant?","Other result","Compliant?","Other result","Compliant?","Other result","Compliant?","Other result","Compliant?","Other result","Compliant?","Other result","Compliant?","Other result","Compliant?","Other result","Compliant?","Other result"]

{"sheet":"Dec-Data","index":32,"n_rows":12,"n_cols":41,"rows_kept":12,"cut":false,"hidden":true,"merged":[[0,0,1,0]]}
["Results",{"$f":"'Audit questions'!A2","v":"Test1"},{"$f":"'Audit questions'!A3","v":"Test2"},{"$f":"'Audit questions'!A4","v":"Test3"},{"$f":"'Audit questions'!A5","v":"Test4"},{"$f":"'Audit questions'!A6","v":"Test5"},{"$f":"'Audit questions'!A7","v":"Test6"},{"$f":"'Audit questions'!A8","v":"Test7"},{"$f":"'Audit questions'!A9","v":"Test8"},{"$f":"'Audit questions'!A10","v":"Test9"},{"$f":"'Audit questions'!A11","v":"Test10"},{"$f":"'Audit questions'!A12","v":"Test11"},{"$f":"'Audit questions'!A13","v":"Test12"},{"$f":"'Audit questions'!A14","v":"Test13"},{"$f":"'Audit questions'!A15","v":"Test14"},{"$f":"'Audit questions'!A16","v":"Test15"},{"$f":"'Audit questions'!A17","v":"Test16"},{"$f":"'Audit questions'!A18","v":"Test17"},{"$f":"'Audit questions'!A19","v":"Test18"},{"$f":"'Audit questions'!A20","v":"Test19"},{"$f":"'Audit questions'!A21","v":"Test20"},{"$f":"'Audit questions'!A22","v":"Test21"},{"$f":"'Audit questions'!A23","v":"Test22"},{"$f":"'Audit questions'!A24","v":"Test23"},{"$f":"'Audit questions'!A25","v":"Test24"},{"$f":"'Audit questions'!A26","v":"Test25"},{"$f":"'Audit questions'!A27","v":"Test26"},{"$f":"'Audit questions'!A28","v":"Test27"},{"$f":"'Audit questions'!A29","v":"Test28"},{"$f":"'Audit questions'!A30","v":"Test29"},{"$f":"'Audit questions'!A31","v":"Test30"},{"$f":"'Audit questions'!A32","v":"Test31"},{"$f":"'Audit questions'!A33","v":"Test32"},{"$f":"'Audit questions'!A34","v":"Test33"},{"$f":"'Audit questions'!A35","v":"Test34"},{"$f":"'Audit questions'!A36","v":"Test35"},{"$f":"'Audit questions'!A37","v":"Test36"},{"$f":"'Audit questions'!A38","v":"Test37"},{"$f":"'Audit questions'!A39","v":"Test38"},{"$f":"'Audit questions'!A40","v":"Test39"},{"$f":"'Audit questions'!A41","v":"Test40"}]
[null,"Compliant?","Compliant?","Compliant?","Compliant?","Compliant?","Compliant?","Compliant?","Compliant?","Compliant?","Compliant?","Compliant?","Compliant?","Compliant?","Compliant?","Compliant?","Compliant?","Compliant?","Compliant?","Compliant?","Compliant?","Compliant?","Compliant?","Compliant?","Compliant?","Compliant?","Compliant?","Compliant?","Compliant?","Compliant?","Compliant?","Compliant?","Compliant?","Compliant?","Compliant?","Compliant?","Compliant?","Compliant?","Compliant?","Compliant?","Compliant?"]
["Total Y",{"$f":"COUNTIF('Dec-Raw'!H:H,\"yes\")","v":0},{"$f":"COUNTIF('Dec-Raw'!J:J,\"yes\")","v":0},{"$f":"COUNTIF('Dec-Raw'!L:L,\"yes\")","v":0},{"$f":"COUNTIF('Dec-Raw'!N:N,\"yes\")","v":0},{"$f":"COUNTIF('Dec-Raw'!P:P,\"yes\")","v":0},{"$f":"COUNTIF('Dec-Raw'!R:R,\"yes\")","v":0},{"$f":"COUNTIF('Dec-Raw'!T:T,\"yes\")","v":0},{"$f":"COUNTIF('Dec-Raw'!V:V,\"yes\")","v":0},{"$f":"COUNTIF('Dec-Raw'!X:X,\"yes\")","v":0},{"$f":"COUNTIF('Dec-Raw'!Z:Z,\"yes\")","v":0},{"$f":"COUNTIF('Dec-Raw'!AB:AB,\"yes\")","v":0},{"$f":"COUNTIF('Dec-Raw'!AD:AD,\"yes\")","v":0},{"$f":"COUNTIF('Dec-Raw'!AF:AF,\"yes\")","v":0},{"$f":"COUNTIF('Dec-Raw'!AH:AH,\"yes\")","v":0},{"$f":"COUNTIF('Dec-Raw'!AJ:AJ,\"yes\")","v":0},{"$f":"COUNTIF('Dec-Raw'!AL:AL,\"yes\")","v":0},{"$f":"COUNTIF('Dec-Raw'!AN:AN,\"yes\")","v":0},{"$f":"COUNTIF('Dec-Raw'!AP:AP,\"yes\")","v":0},{"$f":"COUNTIF('Dec-Raw'!AR:AR,\"yes\")","v":0},{"$f":"COUNTIF('Dec-Raw'!AT:AT,\"yes\")","v":0},{"$f":"COUNTIF('Dec-Raw'!AV:AV,\"yes\")","v":0},{"$f":"COUNTIF('Dec-Raw'!AX:AX,\"yes\")","v":0},{"$f":"COUNTIF('Dec-Raw'!AZ:AZ,\"yes\")","v":0},{"$f":"COUNTIF('Dec-Raw'!BB:BB,\"yes\")","v":0},{"$f":"COUNTIF('Dec-Raw'!BD:BD,\"yes\")","v":0},{"$f":"COUNTIF('Dec-Raw'!BF:BF,\"yes\")","v":0},{"$f":"COUNTIF('Dec-Raw'!BH:BH,\"yes\")","v":0},{"$f":"COUNTIF('Dec-Raw'!BJ:BJ,\"yes\")","v":0},{"$f":"COUNTIF('Dec-Raw'!BL:BL,\"yes\")","v":0},{"$f":"COUNTIF('Dec-Raw'!BN:BN,\"yes\")","v":0},{"$f":"COUNTIF('Dec-Raw'!BP:BP,\"yes\")","v":0},{"$f":"COUNTIF('Dec-Raw'!BR:BR,\"yes\")","v":0},{"$f":"COUNTIF('Dec-Raw'!BT:BT,\"yes\")","v":0},{"$f":"COUNTIF('Dec-Raw'!BV:BV,\"yes\")","v":0},{"$f":"COUNTIF('Dec-Raw'!BX:BX,\"yes\")","v":0},{"$f":"COUNTIF('Dec-Raw'!BZ:BZ,\"yes\")","v":0},{"$f":"COUNTIF('Dec-Raw'!CB:CB,\"yes\")","v":0},{"$f":"COUNTIF('Dec-Raw'!CD:CD,\"yes\")","v":0},{"$f":"COUNTIF('Dec-Raw'!CF:CF,\"yes\")","v":0},{"$f":"COUNTIF('Dec-Raw'!CH:CH,\"yes\")","v":0}]
["Total N",{"$f":"COUNTIF('Dec-Raw'!H:H,\"no\")","v":0},{"$f":"COUNTIF('Dec-Raw'!J:J,\"no\")","v":0},{"$f":"COUNTIF('Dec-Raw'!L:L,\"no\")","v":0},{"$f":"COUNTIF('Dec-Raw'!N:N,\"no\")","v":0},{"$f":"COUNTIF('Dec-Raw'!P:P,\"no\")","v":0},{"$f":"COUNTIF('Dec-Raw'!R:R,\"no\")","v":0},{"$f":"COUNTIF('Dec-Raw'!T:T,\"no\")","v":0},{"$f":"COUNTIF('Dec-Raw'!V:V,\"no\")","v":0},{"$f":"COUNTIF('Dec-Raw'!X:X,\"no\")","v":0},{"$f":"COUNTIF('Dec-Raw'!Z:Z,\"no\")","v":0},{"$f":"COUNTIF('Dec-Raw'!AB:AB,\"no\")","v":0},{"$f":"COUNTIF('Dec-Raw'!AD:AD,\"no\")","v":0},{"$f":"COUNTIF('Dec-Raw'!AF:AF,\"no\")","v":0},{"$f":"COUNTIF('Dec-Raw'!AH:AH,\"no\")","v":0},{"$f":"COUNTIF('Dec-Raw'!AJ:AJ,\"no\")","v":0},{"$f":"COUNTIF('Dec-Raw'!AL:AL,\"no\")","v":0},{"$f":"COUNTIF('Dec-Raw'!AN:AN,\"no\")","v":0},{"$f":"COUNTIF('Dec-Raw'!AP:AP,\"no\")","v":0},{"$f":"COUNTIF('Dec-Raw'!AR:AR,\"no\")","v":0},{"$f":"COUNTIF('Dec-Raw'!AT:AT,\"no\")","v":0},{"$f":"COUNTIF('Dec-Raw'!AV:AV,\"no\")","v":0},{"$f":"COUNTIF('Dec-Raw'!AX:AX,\"no\")","v":0},{"$f":"COUNTIF('Dec-Raw'!AZ:AZ,\"no\")","v":0},{"$f":"COUNTIF('Dec-Raw'!BB:BB,\"no\")","v":0},{"$f":"COUNTIF('Dec-Raw'!BD:BD,\"no\")","v":0},{"$f":"COUNTIF('Dec-Raw'!BF:BF,\"no\")","v":0},{"$f":"COUNTIF('Dec-Raw'!BH:BH,\"no\")","v":0},{"$f":"COUNTIF('Dec-Raw'!BJ:BJ,\"no\")","v":0},{"$f":"COUNTIF('Dec-Raw'!BL:BL,\"no\")","v":0},{"$f":"COUNTIF('Dec-Raw'!BN:BN,\"no\")","v":0},{"$f":"COUNTIF('Dec-Raw'!BP:BP,\"no\")","v":0},{"$f":"COUNTIF('Dec-Raw'!BR:BR,\"no\")","v":0},{"$f":"COUNTIF('Dec-Raw'!BT:BT,\"no\")","v":0},{"$f":"COUNTIF('Dec-Raw'!BV:BV,\"no\")","v":0},{"$f":"COUNTIF('Dec-Raw'!BX:BX,\"no\")","v":0},{"$f":"COUNTIF('Dec-Raw'!BZ:BZ,\"no\")","v":0},{"$f":"COUNTIF('Dec-Raw'!CB:CB,\"no\")","v":0},{"$f":"COUNTIF('Dec-Raw'!CD:CD,\"no\")","v":0},{"$f":"COUNTIF('Dec-Raw'!CF:CF,\"no\")","v":0},{"$f":"COUNTIF('Dec-Raw'!CH:CH,\"no\")","v":0}]
["Total Justified",{"$f":"COUNTIF('Dec-Raw'!H:H,\"Justified\")","v":0},{"$f":"COUNTIF('Dec-Raw'!J:J,\"Justified\")","v":0},{"$f":"COUNTIF('Dec-Raw'!L:L,\"Justified\")","v":0},{"$f":"COUNTIF('Dec-Raw'!N:N,\"Justified\")","v":0},{"$f":"COUNTIF('Dec-Raw'!P:P,\"Justified\")","v":0},{"$f":"COUNTIF('Dec-Raw'!R:R,\"Justified\")","v":0},{"$f":"COUNTIF('Dec-Raw'!T:T,\"Justified\")","v":0},{"$f":"COUNTIF('Dec-Raw'!V:V,\"Justified\")","v":0},{"$f":"COUNTIF('Dec-Raw'!X:X,\"Justified\")","v":0},{"$f":"COUNTIF('Dec-Raw'!Z:Z,\"Justified\")","v":0},{"$f":"COUNTIF('Dec-Raw'!AB:AB,\"Justified\")","v":0},{"$f":"COUNTIF('Dec-Raw'!AD:AD,\"Justified\")","v":0},{"$f":"COUNTIF('Dec-Raw'!AF:AF,\"Justified\")","v":0},{"$f":"COUNTIF('Dec-Raw'!AH:AH,\"Justified\")","v":0},{"$f":"COUNTIF('Dec-Raw'!AJ:AJ,\"Justified\")","v":0},{"$f":"COUNTIF('Dec-Raw'!AL:AL,\"Justified\")","v":0},{"$f":"COUNTIF('Dec-Raw'!AN:AN,\"Justified\")","v":0},{"$f":"COUNTIF('Dec-Raw'!AP:AP,\"Justified\")","v":0},{"$f":"COUNTIF('Dec-Raw'!AR:AR,\"Justified\")","v":0},{"$f":"COUNTIF('Dec-Raw'!AT:AT,\"Justified\")","v":0},{"$f":"COUNTIF('Dec-Raw'!AV:AV,\"Justified\")","v":0},{"$f":"COUNTIF('Dec-Raw'!AX:AX,\"Justified\")","v":0},{"$f":"COUNTIF('Dec-Raw'!AZ:AZ,\"Justified\")","v":0},{"$f":"COUNTIF('Dec-Raw'!BB:BB,\"Justified\")","v":0},{"$f":"COUNTIF('Dec-Raw'!BD:BD,\"Justified\")","v":0},{"$f":"COUNTIF('Dec-Raw'!BF:BF,\"Justified\")","v":0},{"$f":"COUNTIF('Dec-Raw'!BH:BH,\"Justified\")","v":0},{"$f":"COUNTIF('Dec-Raw'!BJ:BJ,\"Justified\")","v":0},{"$f":"COUNTIF('Dec-Raw'!BL:BL,\"Justified\")","v":0},{"$f":"COUNTIF('Dec-Raw'!BN:BN,\"Justified\")","v":0},{"$f":"COUNTIF('Dec-Raw'!BP:BP,\"Justified\")","v":0},{"$f":"COUNTIF('Dec-Raw'!BR:BR,\"Justified\")","v":0},{"$f":"COUNTIF('Dec-Raw'!BT:BT,\"Justified\")","v":0},{"$f":"COUNTIF('Dec-Raw'!BV:BV,\"Justified\")","v":0},{"$f":"COUNTIF('Dec-Raw'!BX:BX,\"Justified\")","v":0},{"$f":"COUNTIF('Dec-Raw'!BZ:BZ,\"Justified\")","v":0},{"$f":"COUNTIF('Dec-Raw'!CB:CB,\"Justified\")","v":0},{"$f":"COUNTIF('Dec-Raw'!CD:CD,\"Justified\")","v":0},{"$f":"COUNTIF('Dec-Raw'!CF:CF,\"Justified\")","v":0},{"$f":"COUNTIF('Dec-Raw'!CH:CH,\"Justified\")","v":0}]
["Total NA",{"$f":"COUNTIF('Dec-Raw'!H:H,\"NA\")","v":0},{"$f":"COUNTIF('Dec-Raw'!J:J,\"NA\")","v":0},{"$f":"COUNTIF('Dec-Raw'!L:L,\"NA\")","v":0},{"$f":"COUNTIF('Dec-Raw'!N:N,\"NA\")","v":0},{"$f":"COUNTIF('Dec-Raw'!P:P,\"NA\")","v":0},{"$f":"COUNTIF('Dec-Raw'!R:R,\"NA\")","v":0},{"$f":"COUNTIF('Dec-Raw'!T:T,\"NA\")","v":0},{"$f":"COUNTIF('Dec-Raw'!V:V,\"NA\")","v":0},{"$f":"COUNTIF('Dec-Raw'!X:X,\"NA\")","v":0},{"$f":"COUNTIF('Dec-Raw'!Z:Z,\"NA\")","v":0},{"$f":"COUNTIF('Dec-Raw'!AB:AB,\"NA\")","v":0},{"$f":"COUNTIF('Dec-Raw'!AD:AD,\"NA\")","v":0},{"$f":"COUNTIF('Dec-Raw'!AF:AF,\"NA\")","v":0},{"$f":"COUNTIF('Dec-Raw'!AH:AH,\"NA\")","v":0},{"$f":"COUNTIF('Dec-Raw'!AJ:AJ,\"NA\")","v":0},{"$f":"COUNTIF('Dec-Raw'!AL:AL,\"NA\")","v":0},{"$f":"COUNTIF('Dec-Raw'!AN:AN,\"NA\")","v":0},{"$f":"COUNTIF('Dec-Raw'!AP:AP,\"NA\")","v":0},{"$f":"COUNTIF('Dec-Raw'!AR:AR,\"NA\")","v":0},{"$f":"COUNTIF('Dec-Raw'!AT:AT,\"NA\")","v":0},{"$f":"COUNTIF('Dec-Raw'!AV:AV,\"NA\")","v":0},{"$f":"COUNTIF('Dec-Raw'!AX:AX,\"NA\")","v":0},{"$f":"COUNTIF('Dec-Raw'!AZ:AZ,\"NA\")","v":0},{"$f":"COUNTIF('Dec-Raw'!BB:BB,\"NA\")","v":0},{"$f":"COUNTIF('Dec-Raw'!BD:BD,\"NA\")","v":0},{"$f":"COUNTIF('Dec-Raw'!BF:BF,\"NA\")","v":0},{"$f":"COUNTIF('Dec-Raw'!BH:BH,\"NA\")","v":0},{"$f":"COUNTIF('Dec-Raw'!BJ:BJ,\"NA\")","v":0},{"$f":"COUNTIF('Dec-Raw'!BL:BL,\"NA\")","v":0},{"$f":"COUNTIF('Dec-Raw'!BN:BN,\"NA\")","v":0},{"$f":"COUNTIF('Dec-Raw'!BP:BP,\"NA\")","v":0},{"$f":"COUNTIF('Dec-Raw'!BR:BR,\"NA\")","v":0},{"$f":"COUNTIF('Dec-Raw'!BT:BT,\"NA\")","v":0},{"$f":"COUNTIF('Dec-Raw'!BV:BV,\"NA\")","v":0},{"$f":"COUNTIF('Dec-Raw'!BX:BX,\"NA\")","v":0},{"$f":"COUNTIF('Dec-Raw'!BZ:BZ,\"NA\")","v":0},{"$f":"COUNTIF('Dec-Raw'!CB:CB,\"NA\")","v":0},{"$f":"COUNTIF('Dec-Raw'!CD:CD,\"NA\")","v":0},{"$f":"COUNTIF('Dec-Raw'!CF:CF,\"NA\")","v":0},{"$f":"COUNTIF('Dec-Raw'!CH:CH,\"NA\")","v":0}]
["Blanks",{"$f":"B8-(SUM(B3:B6))","v":0},{"$f":"C8-(SUM(C3:C6))","v":0},0,0,0,0,0,0,0,0,0,0,0,0,0,0,0,0,0,0,0,0,0,0,0,0,0,0,0,0,0,0,0,0,0,0,0,0,0,0]
["full sample size",{"$f":"COUNTA('Dec-Raw'!A:A)-2","v":0},{"$f":"B8","v":0},0,0,0,0,0,0,0,0,0,0,0,0,0,0,0,0,0,0,0,0,0,0,0,0,0,0,0,0,0,0,0,0,0,0,0,0,0,0]
["True sample size (-NA + blanks)",{"$f":"IF(ISERROR(B8-(B6+B7)),\"\",B8-(B6+B7))","v":0},{"$f":"IF(ISERROR(C8-(C6+C7)),\"\",C8-(C6+C7))","v":0},0,0,0,0,0,0,0,0,0,0,0,0,0,0,0,0,0,0,0,0,0,0,0,0,0,0,0,0,0,0,0,0,0,0,0,0,0,0]
["%Y",{"$f":"IF(ISERROR(B3/B9),\"\",B3/B9)","v":""},{"$f":"IF(ISERROR(C3/C9),\"\",C3/C9)","v":""},"","","","","","","","","","","","","","","","","","","","","","","","","","","","","","","","","","","","","",""]
["%N",{"$f":"IF(ISERROR(B4/B9),\"\",B4/B9)","v":""},{"$f":"IF(ISERROR(C4/C9),\"\",C4/C9)","v":""},"","","","","","","","","","","","","","","","","","","","","","","","","","","","","","","","","","","","","",""]
["%N - Justified",{"$f":"IF(ISERROR(B5/B9),\"\",B5/B9)","v":""},{"$f":"IF(ISERROR(C5/C9),\"\",C5/C9)","v":""},"","","","","","","","","","","","","","","","","","","","","","","","","","","","","","","","","","","","","",""]

{"sheet":"Jan","index":33,"n_rows":51,"n_cols":8,"rows_kept":51,"cut":false,"hidden":false,"merged":[]}
["Click here to go to year overview"]
[]
["Date",null,null,"Total by Apt type"]
["Completed by",null,null,"New",{"$f":"COUNTIF('Jan-Raw'!E3:E103,\"New\")","v":0}]
["Sample group size",{"$f":"COUNTA('Jan-Raw'!A:A)-2","v":0},null,"Follow up",{"$f":"COUNTIF('Jan-Raw'!E3:E103,\"Fup\")","v":0},null,null,{"$f":"Year!H5","v":0.95}]
["Overall Result (compliant only)",{"$f":"IF(ISERROR(SUM(C11:C50)/G51),\"\",SUM(C11:C50)/G51)","v":""},null,"Total by apt Code",null,null,null,{"$f":"Year!H6","v":"80-95%"}]
["Overall Result (compliant & Justified)",{"$f":"IF(ISERROR(SUM(B11:B50)/G51),\"\",SUM(B11:B50)/G51)","v":""},null,"code goes in here",{"$f":"COUNTIF('Jan-Raw'!F3:F103,D7)","v":0},null,null,{"$f":"Year!H7","v":0.8}]
["viable qs",{"$f":"G51","v":0}]
[]
["Metric","Compliant + Justified","Compliant","Justified","Not compliant","Irritating math"]
[{"$f":"IF(ISERROR('Audit questions'!A2),\"\",'Audit questions'!A2)","v":"Test1"},{"$f":"IF(ISERROR(C11+D11),\"\",C11+D11)","v":""},{"$f":"'Jan-Data'!B10","v":""},{"$f":"'Jan-Data'!B12","v":""},{"$f":"'Jan-Data'!B11","v":""},{"$f":"COUNTIF(C11:E11,\">0\")","v":0}]
[{"$f":"IF(ISERROR('Audit questions'!A3),\"\",'Audit questions'!A3)","v":"Test2"},"",{"$f":"'Jan-Data'!C10","v":""},{"$f":"'Jan-Data'!C12","v":""},{"$f":"'Jan-Data'!C11","v":""},0]
[{"$f":"IF(ISERROR('Audit questions'!A4),\"\",'Audit questions'!A4)","v":"Test3"},"",{"$f":"'Jan-Data'!D10","v":""},{"$f":"'Jan-Data'!D12","v":""},{"$f":"'Jan-Data'!D11","v":""},0]
[{"$f":"IF(ISERROR('Audit questions'!A5),\"\",'Audit questions'!A5)","v":"Test4"},"",{"$f":"'Jan-Data'!E10","v":""},{"$f":"'Jan-Data'!E12","v":""},{"$f":"'Jan-Data'!E11","v":""},0]
[{"$f":"IF(ISERROR('Audit questions'!A6),\"\",'Audit questions'!A6)","v":"Test5"},"",{"$f":"'Jan-Data'!F10","v":""},{"$f":"'Jan-Data'!F12","v":""},{"$f":"'Jan-Data'!F11","v":""},0]
[{"$f":"IF(ISERROR('Audit questions'!A7),\"\",'Audit questions'!A7)","v":"Test6"},"",{"$f":"'Jan-Data'!G10","v":""},{"$f":"'Jan-Data'!G12","v":""},{"$f":"'Jan-Data'!G11","v":""},0]
[{"$f":"IF(ISERROR('Audit questions'!A8),\"\",'Audit questions'!A8)","v":"Test7"},"",{"$f":"'Jan-Data'!H10","v":""},{"$f":"'Jan-Data'!H12","v":""},{"$f":"'Jan-Data'!H11","v":""},0]
[{"$f":"IF(ISERROR('Audit questions'!A9),\"\",'Audit questions'!A9)","v":"Test8"},"",{"$f":"'Jan-Data'!I10","v":""},{"$f":"'Jan-Data'!I12","v":""},{"$f":"'Jan-Data'!I11","v":""},0]
[{"$f":"IF(ISERROR('Audit questions'!A10),\"\",'Audit questions'!A10)","v":"Test9"},"",{"$f":"'Jan-Data'!J10","v":""},{"$f":"'Jan-Data'!J12","v":""},{"$f":"'Jan-Data'!J11","v":""},0]
[{"$f":"IF(ISERROR('Audit questions'!A11),\"\",'Audit questions'!A11)","v":"Test10"},"",{"$f":"'Jan-Data'!K10","v":""},{"$f":"'Jan-Data'!K12","v":""},{"$f":"'Jan-Data'!K11","v":""},0]
[{"$f":"IF(ISERROR('Audit questions'!A12),\"\",'Audit questions'!A12)","v":"Test11"},"",{"$f":"'Jan-Data'!L10","v":""},{"$f":"'Jan-Data'!L12","v":""},{"$f":"'Jan-Data'!L11","v":""},0]
[{"$f":"IF(ISERROR('Audit questions'!A13),\"\",'Audit questions'!A13)","v":"Test12"},"",{"$f":"'Jan-Data'!M10","v":""},{"$f":"'Jan-Data'!M12","v":""},{"$f":"'Jan-Data'!M11","v":""},0]
[{"$f":"IF(ISERROR('Audit questions'!A14),\"\",'Audit questions'!A14)","v":"Test13"},"",{"$f":"'Jan-Data'!N10","v":""},{"$f":"'Jan-Data'!N12","v":""},{"$f":"'Jan-Data'!N11","v":""},0]
[{"$f":"IF(ISERROR('Audit questions'!A15),\"\",'Audit questions'!A15)","v":"Test14"},"",{"$f":"'Jan-Data'!O10","v":""},{"$f":"'Jan-Data'!O12","v":""},{"$f":"'Jan-Data'!O11","v":""},0]
[{"$f":"IF(ISERROR('Audit questions'!A16),\"\",'Audit questions'!A16)","v":"Test15"},"",{"$f":"'Jan-Data'!P10","v":""},{"$f":"'Jan-Data'!P12","v":""},{"$f":"'Jan-Data'!P11","v":""},0]
[{"$f":"IF(ISERROR('Audit questions'!A17),\"\",'Audit questions'!A17)","v":"Test16"},"",{"$f":"'Jan-Data'!Q10","v":""},{"$f":"'Jan-Data'!Q12","v":""},{"$f":"'Jan-Data'!Q11","v":""},0]
[{"$f":"IF(ISERROR('Audit questions'!A18),\"\",'Audit questions'!A18)","v":"Test17"},"",{"$f":"'Jan-Data'!R10","v":""},{"$f":"'Jan-Data'!R12","v":""},{"$f":"'Jan-Data'!R11","v":""},0]
[{"$f":"IF(ISERROR('Audit questions'!A19),\"\",'Audit questions'!A19)","v":"Test18"},"",{"$f":"'Jan-Data'!S10","v":""},{"$f":"'Jan-Data'!S12","v":""},{"$f":"'Jan-Data'!S11","v":""},0]
[{"$f":"IF(ISERROR('Audit questions'!A20),\"\",'Audit questions'!A20)","v":"Test19"},"",{"$f":"'Jan-Data'!T10","v":""},{"$f":"'Jan-Data'!T12","v":""},{"$f":"'Jan-Data'!T11","v":""},0]
[{"$f":"IF(ISERROR('Audit questions'!A21),\"\",'Audit questions'!A21)","v":"Test20"},"",{"$f":"'Jan-Data'!U10","v":""},{"$f":"'Jan-Data'!U12","v":""},{"$f":"'Jan-Data'!U11","v":""},0]
[{"$f":"IF(ISERROR('Audit questions'!A22),\"\",'Audit questions'!A22)","v":"Test21"},"",{"$f":"'Jan-Data'!V10","v":""},{"$f":"'Jan-Data'!V12","v":""},{"$f":"'Jan-Data'!V11","v":""},0]
[{"$f":"IF(ISERROR('Audit questions'!A23),\"\",'Audit questions'!A23)","v":"Test22"},"",{"$f":"'Jan-Data'!W10","v":""},{"$f":"'Jan-Data'!W12","v":""},{"$f":"'Jan-Data'!W11","v":""},0]
[{"$f":"IF(ISERROR('Audit questions'!A24),\"\",'Audit questions'!A24)","v":"Test23"},"",{"$f":"'Jan-Data'!X10","v":""},{"$f":"'Jan-Data'!X12","v":""},{"$f":"'Jan-Data'!X11","v":""},0]
[{"$f":"IF(ISERROR('Audit questions'!A25),\"\",'Audit questions'!A25)","v":"Test24"},"",{"$f":"'Jan-Data'!Y10","v":""},{"$f":"'Jan-Data'!Y12","v":""},{"$f":"'Jan-Data'!Y11","v":""},0]
[{"$f":"IF(ISERROR('Audit questions'!A26),\"\",'Audit questions'!A26)","v":"Test25"},"",{"$f":"'Jan-Data'!Z10","v":""},{"$f":"'Jan-Data'!Z12","v":""},{"$f":"'Jan-Data'!Z11","v":""},0]
[{"$f":"IF(ISERROR('Audit questions'!A27),\"\",'Audit questions'!A27)","v":"Test26"},"",{"$f":"'Jan-Data'!AA10","v":""},{"$f":"'Jan-Data'!AA12","v":""},{"$f":"'Jan-Data'!AA11","v":""},0]
[{"$f":"IF(ISERROR('Audit questions'!A28),\"\",'Audit questions'!A28)","v":"Test27"},"",{"$f":"'Jan-Data'!AB10","v":""},{"$f":"'Jan-Data'!AB12","v":""},{"$f":"'Jan-Data'!AB11","v":""},0]
[{"$f":"IF(ISERROR('Audit questions'!A29),\"\",'Audit questions'!A29)","v":"Test28"},"",{"$f":"'Jan-Data'!AC10","v":""},{"$f":"'Jan-Data'!AC12","v":""},{"$f":"'Jan-Data'!AC11","v":""},0]
[{"$f":"IF(ISERROR('Audit questions'!A30),\"\",'Audit questions'!A30)","v":"Test29"},"",{"$f":"'Jan-Data'!AD10","v":""},{"$f":"'Jan-Data'!AD12","v":""},{"$f":"'Jan-Data'!AD11","v":""},0]
[{"$f":"IF(ISERROR('Audit questions'!A31),\"\",'Audit questions'!A31)","v":"Test30"},"",{"$f":"'Jan-Data'!AE10","v":""},{"$f":"'Jan-Data'!AE12","v":""},{"$f":"'Jan-Data'!AE11","v":""},0]
[{"$f":"IF(ISERROR('Audit questions'!A32),\"\",'Audit questions'!A32)","v":"Test31"},"",{"$f":"'Jan-Data'!AF10","v":""},{"$f":"'Jan-Data'!AF12","v":""},{"$f":"'Jan-Data'!AF11","v":""},0]
[{"$f":"IF(ISERROR('Audit questions'!A33),\"\",'Audit questions'!A33)","v":"Test32"},"",{"$f":"'Jan-Data'!AG10","v":""},{"$f":"'Jan-Data'!AG12","v":""},{"$f":"'Jan-Data'!AG11","v":""},0]
[{"$f":"IF(ISERROR('Audit questions'!A34),\"\",'Audit questions'!A34)","v":"Test33"},"",{"$f":"'Jan-Data'!AH10","v":""},{"$f":"'Jan-Data'!AH12","v":""},{"$f":"'Jan-Data'!AH11","v":""},0]
[{"$f":"IF(ISERROR('Audit questions'!A35),\"\",'Audit questions'!A35)","v":"Test34"},"",{"$f":"'Jan-Data'!AI10","v":""},{"$f":"'Jan-Data'!AI12","v":""},{"$f":"'Jan-Data'!AI11","v":""},0]
[{"$f":"IF(ISERROR('Audit questions'!A36),\"\",'Audit questions'!A36)","v":"Test35"},"",{"$f":"'Jan-Data'!AJ10","v":""},{"$f":"'Jan-Data'!AJ12","v":""},{"$f":"'Jan-Data'!AJ11","v":""},0]
[{"$f":"IF(ISERROR('Audit questions'!A37),\"\",'Audit questions'!A37)","v":"Test36"},"",{"$f":"'Jan-Data'!AK10","v":""},{"$f":"'Jan-Data'!AK12","v":""},{"$f":"'Jan-Data'!AK11","v":""},0]
[{"$f":"IF(ISERROR('Audit questions'!A38),\"\",'Audit questions'!A38)","v":"Test37"},"",{"$f":"'Jan-Data'!AL10","v":""},{"$f":"'Jan-Data'!AL12","v":""},{"$f":"'Jan-Data'!AL11","v":""},0]
[{"$f":"IF(ISERROR('Audit questions'!A39),\"\",'Audit questions'!A39)","v":"Test38"},"",{"$f":"'Jan-Data'!AM10","v":""},{"$f":"'Jan-Data'!AM12","v":""},{"$f":"'Jan-Data'!AM11","v":""},0]
[{"$f":"IF(ISERROR('Audit questions'!A40),\"\",'Audit questions'!A40)","v":"Test39"},"",{"$f":"'Jan-Data'!AN10","v":""},{"$f":"'Jan-Data'!AN12","v":""},{"$f":"'Jan-Data'!AN11","v":""},0]
[{"$f":"IF(ISERROR('Audit questions'!A41),\"\",'Audit questions'!A41)","v":"Test40"},"",{"$f":"'Jan-Data'!AO10","v":""},{"$f":"'Jan-Data'!AO12","v":""},{"$f":"'Jan-Data'!AO11","v":""},0]
[null,null,null,null,null,null,{"$f":"COUNTIF(F11:F50,\">=1\")","v":0}]

{"sheet":"Jan-Raw","index":34,"n_rows":2,"n_cols":87,"rows_kept":2,"cut":false,"hidden":true,"merged":[[0,85,0,86],[0,63,0,64],[0,65,0,66],[0,67,0,68],[0,69,0,70],[0,71,0,72],[0,73,0,74],[0,75,0,76],[0,77,0,78],[0,79,0,80],[0,81,0,82],[0,83,0,84],[0,61,0,62],[0,39,0,40],[0,41,0,42],[0,43,0,44],[0,45,0,46],[0,47,0,48],[0,49,0,50],[0,51,0,52],[0,53,0,54],[0,55,0,56],[0,57,0,58],[0,59,0,60],[0,37,0,38],[0,15,0,16],[0,17,0,18],[0,19,0,20],[0,21,0,22],[0,23,0,24],[0,25,0,26],[0,27,0,28],[0,29,0,30],[0,31,0,32],[0,33,0,34],[0,35,0,36],[0,13,0,14],[0,0,0,5],[0,6,1,6],[0,7,0,8],[0,9,0,10],[0,11,0,12]]}
["Record details",null,null,null,null,null,"Notes",{"$f":"'Audit questions'!A2","v":"Test1"},null,{"$f":"'Audit questions'!A3","v":"Test2"},null,{"$f":"'Audit questions'!A4","v":"Test3"},null,{"$f":"'Audit questions'!A5","v":"Test4"},null,{"$f":"'Audit questions'!A6","v":"Test5"},null,{"$f":"'Audit questions'!A7","v":"Test6"},null,{"$f":"'Audit questions'!A8","v":"Test7"},null,{"$f":"'Audit questions'!A9","v":"Test8"},null,{"$f":"'Audit questions'!A10","v":"Test9"},null,{"$f":"'Audit questions'!A11","v":"Test10"},null,{"$f":"'Audit questions'!A12","v":"Test11"},null,{"$f":"'Audit questions'!A13","v":"Test12"},null,{"$f":"'Audit questions'!A14","v":"Test13"},null,{"$f":"'Audit questions'!A15","v":"Test14"},null,{"$f":"'Audit questions'!A16","v":"Test15"},null,{"$f":"'Audit questions'!A17","v":"Test16"},null,{"$f":"'Audit questions'!A18","v":"Test17"},null,{"$f":"'Audit questions'!A19","v":"Test18"},null,{"$f":"'Audit questions'!A20","v":"Test19"},null,{"$f":"'Audit questions'!A21","v":"Test20"},null,{"$f":"'Audit questions'!A22","v":"Test21"},null,{"$f":"'Audit questions'!A23","v":"Test22"},null,{"$f":"'Audit questions'!A24","v":"Test23"},null,{"$f":"'Audit questions'!A25","v":"Test24"},null,{"$f":"'Audit questions'!A26","v":"Test25"},null,{"$f":"'Audit questions'!A27","v":"Test26"},null,{"$f":"'Audit questions'!A28","v":"Test27"},null,{"$f":"'Audit questions'!A29","v":"Test28"},null,{"$f":"'Audit questions'!A30","v":"Test29"},null,{"$f":"'Audit questions'!A31","v":"Test30"},null,{"$f":"'Audit questions'!A32","v":"Test31"},null,{"$f":"'Audit questions'!A33","v":"Test32"},null,{"$f":"'Audit questions'!A34","v":"Test33"},null,{"$f":"'Audit questions'!A35","v":"Test34"},null,{"$f":"'Audit questions'!A36","v":"Test35"},null,{"$f":"'Audit questions'!A37","v":"Test36"},null,{"$f":"'Audit questions'!A38","v":"Test37"},null,{"$f":"'Audit questions'!A39","v":"Test38"},null,{"$f":"'Audit questions'!A40","v":"Test39"},null,{"$f":"'Audit questions'!A41","v":"Test40"}]
["Pt number","Date seen","Clinician 1","clinician 2","New/ F-up","Apt code",null,"Compliant?","Other result","Compliant?","Other result","Compliant?","Other result","Compliant?","Other result","Compliant?","Other result","Compliant?","Other result","Compliant?","Other result","Compliant?","Other result","Compliant?","Other result","Compliant?","Other result","Compliant?","Other result","Compliant?","Other result","Compliant?","Other result","Compliant?","Other result","Compliant?","Other result","Compliant?","Other result","Compliant?","Other result","Compliant?","Other result","Compliant?","Other result","Compliant?","Other result","Compliant?","Other result","Compliant?","Other result","Compliant?","Other result","Compliant?","Other result","Compliant?","Other result","Compliant?","Other result","Compliant?","Other result","Compliant?","Other result","Compliant?","Other result","Compliant?","Other result","Compliant?","Other result","Compliant?","Other result","Compliant?","Other result","Compliant?","Other result","Compliant?","Other result","Compliant?","Other result","Compliant?","Other result","Compliant?","Other result","Compliant?","Other result","Compliant?","Other result"]

{"sheet":"Jan-Data","index":35,"n_rows":12,"n_cols":41,"rows_kept":12,"cut":false,"hidden":true,"merged":[[0,0,1,0]]}
["Results",{"$f":"'Audit questions'!A2","v":"Test1"},{"$f":"'Audit questions'!A3","v":"Test2"},{"$f":"'Audit questions'!A4","v":"Test3"},{"$f":"'Audit questions'!A5","v":"Test4"},{"$f":"'Audit questions'!A6","v":"Test5"},{"$f":"'Audit questions'!A7","v":"Test6"},{"$f":"'Audit questions'!A8","v":"Test7"},{"$f":"'Audit questions'!A9","v":"Test8"},{"$f":"'Audit questions'!A10","v":"Test9"},{"$f":"'Audit questions'!A11","v":"Test10"},{"$f":"'Audit questions'!A12","v":"Test11"},{"$f":"'Audit questions'!A13","v":"Test12"},{"$f":"'Audit questions'!A14","v":"Test13"},{"$f":"'Audit questions'!A15","v":"Test14"},{"$f":"'Audit questions'!A16","v":"Test15"},{"$f":"'Audit questions'!A17","v":"Test16"},{"$f":"'Audit questions'!A18","v":"Test17"},{"$f":"'Audit questions'!A19","v":"Test18"},{"$f":"'Audit questions'!A20","v":"Test19"},{"$f":"'Audit questions'!A21","v":"Test20"},{"$f":"'Audit questions'!A22","v":"Test21"},{"$f":"'Audit questions'!A23","v":"Test22"},{"$f":"'Audit questions'!A24","v":"Test23"},{"$f":"'Audit questions'!A25","v":"Test24"},{"$f":"'Audit questions'!A26","v":"Test25"},{"$f":"'Audit questions'!A27","v":"Test26"},{"$f":"'Audit questions'!A28","v":"Test27"},{"$f":"'Audit questions'!A29","v":"Test28"},{"$f":"'Audit questions'!A30","v":"Test29"},{"$f":"'Audit questions'!A31","v":"Test30"},{"$f":"'Audit questions'!A32","v":"Test31"},{"$f":"'Audit questions'!A33","v":"Test32"},{"$f":"'Audit questions'!A34","v":"Test33"},{"$f":"'Audit questions'!A35","v":"Test34"},{"$f":"'Audit questions'!A36","v":"Test35"},{"$f":"'Audit questions'!A37","v":"Test36"},{"$f":"'Audit questions'!A38","v":"Test37"},{"$f":"'Audit questions'!A39","v":"Test38"},{"$f":"'Audit questions'!A40","v":"Test39"},{"$f":"'Audit questions'!A41","v":"Test40"}]
[null,"Compliant?","Compliant?","Compliant?","Compliant?","Compliant?","Compliant?","Compliant?","Compliant?","Compliant?","Compliant?","Compliant?","Compliant?","Compliant?","Compliant?","Compliant?","Compliant?","Compliant?","Compliant?","Compliant?","Compliant?","Compliant?","Compliant?","Compliant?","Compliant?","Compliant?","Compliant?","Compliant?","Compliant?","Compliant?","Compliant?","Compliant?","Compliant?","Compliant?","Compliant?","Compliant?","Compliant?","Compliant?","Compliant?","Compliant?","Compliant?"]
["Total Y",{"$f":"COUNTIF('Jan-Raw'!H:H,\"yes\")","v":0},{"$f":"COUNTIF('Jan-Raw'!J:J,\"yes\")","v":0},{"$f":"COUNTIF('Jan-Raw'!L:L,\"yes\")","v":0},{"$f":"COUNTIF('Jan-Raw'!N:N,\"yes\")","v":0},{"$f":"COUNTIF('Jan-Raw'!P:P,\"yes\")","v":0},{"$f":"COUNTIF('Jan-Raw'!R:R,\"yes\")","v":0},{"$f":"COUNTIF('Jan-Raw'!T:T,\"yes\")","v":0},{"$f":"COUNTIF('Jan-Raw'!V:V,\"yes\")","v":0},{"$f":"COUNTIF('Jan-Raw'!X:X,\"yes\")","v":0},{"$f":"COUNTIF('Jan-Raw'!Z:Z,\"yes\")","v":0},{"$f":"COUNTIF('Jan-Raw'!AB:AB,\"yes\")","v":0},{"$f":"COUNTIF('Jan-Raw'!AD:AD,\"yes\")","v":0},{"$f":"COUNTIF('Jan-Raw'!AF:AF,\"yes\")","v":0},{"$f":"COUNTIF('Jan-Raw'!AH:AH,\"yes\")","v":0},{"$f":"COUNTIF('Jan-Raw'!AJ:AJ,\"yes\")","v":0},{"$f":"COUNTIF('Jan-Raw'!AL:AL,\"yes\")","v":0},{"$f":"COUNTIF('Jan-Raw'!AN:AN,\"yes\")","v":0},{"$f":"COUNTIF('Jan-Raw'!AP:AP,\"yes\")","v":0},{"$f":"COUNTIF('Jan-Raw'!AR:AR,\"yes\")","v":0},{"$f":"COUNTIF('Jan-Raw'!AT:AT,\"yes\")","v":0},{"$f":"COUNTIF('Jan-Raw'!AV:AV,\"yes\")","v":0},{"$f":"COUNTIF('Jan-Raw'!AX:AX,\"yes\")","v":0},{"$f":"COUNTIF('Jan-Raw'!AZ:AZ,\"yes\")","v":0},{"$f":"COUNTIF('Jan-Raw'!BB:BB,\"yes\")","v":0},{"$f":"COUNTIF('Jan-Raw'!BD:BD,\"yes\")","v":0},{"$f":"COUNTIF('Jan-Raw'!BF:BF,\"yes\")","v":0},{"$f":"COUNTIF('Jan-Raw'!BH:BH,\"yes\")","v":0},{"$f":"COUNTIF('Jan-Raw'!BJ:BJ,\"yes\")","v":0},{"$f":"COUNTIF('Jan-Raw'!BL:BL,\"yes\")","v":0},{"$f":"COUNTIF('Jan-Raw'!BN:BN,\"yes\")","v":0},{"$f":"COUNTIF('Jan-Raw'!BP:BP,\"yes\")","v":0},{"$f":"COUNTIF('Jan-Raw'!BR:BR,\"yes\")","v":0},{"$f":"COUNTIF('Jan-Raw'!BT:BT,\"yes\")","v":0},{"$f":"COUNTIF('Jan-Raw'!BV:BV,\"yes\")","v":0},{"$f":"COUNTIF('Jan-Raw'!BX:BX,\"yes\")","v":0},{"$f":"COUNTIF('Jan-Raw'!BZ:BZ,\"yes\")","v":0},{"$f":"COUNTIF('Jan-Raw'!CB:CB,\"yes\")","v":0},{"$f":"COUNTIF('Jan-Raw'!CD:CD,\"yes\")","v":0},{"$f":"COUNTIF('Jan-Raw'!CF:CF,\"yes\")","v":0},{"$f":"COUNTIF('Jan-Raw'!CH:CH,\"yes\")","v":0}]
["Total N",{"$f":"COUNTIF('Jan-Raw'!H:H,\"no\")","v":0},{"$f":"COUNTIF('Jan-Raw'!J:J,\"no\")","v":0},{"$f":"COUNTIF('Jan-Raw'!L:L,\"no\")","v":0},{"$f":"COUNTIF('Jan-Raw'!N:N,\"no\")","v":0},{"$f":"COUNTIF('Jan-Raw'!P:P,\"no\")","v":0},{"$f":"COUNTIF('Jan-Raw'!R:R,\"no\")","v":0},{"$f":"COUNTIF('Jan-Raw'!T:T,\"no\")","v":0},{"$f":"COUNTIF('Jan-Raw'!V:V,\"no\")","v":0},{"$f":"COUNTIF('Jan-Raw'!X:X,\"no\")","v":0},{"$f":"COUNTIF('Jan-Raw'!Z:Z,\"no\")","v":0},{"$f":"COUNTIF('Jan-Raw'!AB:AB,\"no\")","v":0},{"$f":"COUNTIF('Jan-Raw'!AD:AD,\"no\")","v":0},{"$f":"COUNTIF('Jan-Raw'!AF:AF,\"no\")","v":0},{"$f":"COUNTIF('Jan-Raw'!AH:AH,\"no\")","v":0},{"$f":"COUNTIF('Jan-Raw'!AJ:AJ,\"no\")","v":0},{"$f":"COUNTIF('Jan-Raw'!AL:AL,\"no\")","v":0},{"$f":"COUNTIF('Jan-Raw'!AN:AN,\"no\")","v":0},{"$f":"COUNTIF('Jan-Raw'!AP:AP,\"no\")","v":0},{"$f":"COUNTIF('Jan-Raw'!AR:AR,\"no\")","v":0},{"$f":"COUNTIF('Jan-Raw'!AT:AT,\"no\")","v":0},{"$f":"COUNTIF('Jan-Raw'!AV:AV,\"no\")","v":0},{"$f":"COUNTIF('Jan-Raw'!AX:AX,\"no\")","v":0},{"$f":"COUNTIF('Jan-Raw'!AZ:AZ,\"no\")","v":0},{"$f":"COUNTIF('Jan-Raw'!BB:BB,\"no\")","v":0},{"$f":"COUNTIF('Jan-Raw'!BD:BD,\"no\")","v":0},{"$f":"COUNTIF('Jan-Raw'!BF:BF,\"no\")","v":0},{"$f":"COUNTIF('Jan-Raw'!BH:BH,\"no\")","v":0},{"$f":"COUNTIF('Jan-Raw'!BJ:BJ,\"no\")","v":0},{"$f":"COUNTIF('Jan-Raw'!BL:BL,\"no\")","v":0},{"$f":"COUNTIF('Jan-Raw'!BN:BN,\"no\")","v":0},{"$f":"COUNTIF('Jan-Raw'!BP:BP,\"no\")","v":0},{"$f":"COUNTIF('Jan-Raw'!BR:BR,\"no\")","v":0},{"$f":"COUNTIF('Jan-Raw'!BT:BT,\"no\")","v":0},{"$f":"COUNTIF('Jan-Raw'!BV:BV,\"no\")","v":0},{"$f":"COUNTIF('Jan-Raw'!BX:BX,\"no\")","v":0},{"$f":"COUNTIF('Jan-Raw'!BZ:BZ,\"no\")","v":0},{"$f":"COUNTIF('Jan-Raw'!CB:CB,\"no\")","v":0},{"$f":"COUNTIF('Jan-Raw'!CD:CD,\"no\")","v":0},{"$f":"COUNTIF('Jan-Raw'!CF:CF,\"no\")","v":0},{"$f":"COUNTIF('Jan-Raw'!CH:CH,\"no\")","v":0}]
["Total Justified",{"$f":"COUNTIF('Jan-Raw'!H:H,\"Justified\")","v":0},{"$f":"COUNTIF('Jan-Raw'!J:J,\"Justified\")","v":0},{"$f":"COUNTIF('Jan-Raw'!L:L,\"Justified\")","v":0},{"$f":"COUNTIF('Jan-Raw'!N:N,\"Justified\")","v":0},{"$f":"COUNTIF('Jan-Raw'!P:P,\"Justified\")","v":0},{"$f":"COUNTIF('Jan-Raw'!R:R,\"Justified\")","v":0},{"$f":"COUNTIF('Jan-Raw'!T:T,\"Justified\")","v":0},{"$f":"COUNTIF('Jan-Raw'!V:V,\"Justified\")","v":0},{"$f":"COUNTIF('Jan-Raw'!X:X,\"Justified\")","v":0},{"$f":"COUNTIF('Jan-Raw'!Z:Z,\"Justified\")","v":0},{"$f":"COUNTIF('Jan-Raw'!AB:AB,\"Justified\")","v":0},{"$f":"COUNTIF('Jan-Raw'!AD:AD,\"Justified\")","v":0},{"$f":"COUNTIF('Jan-Raw'!AF:AF,\"Justified\")","v":0},{"$f":"COUNTIF('Jan-Raw'!AH:AH,\"Justified\")","v":0},{"$f":"COUNTIF('Jan-Raw'!AJ:AJ,\"Justified\")","v":0},{"$f":"COUNTIF('Jan-Raw'!AL:AL,\"Justified\")","v":0},{"$f":"COUNTIF('Jan-Raw'!AN:AN,\"Justified\")","v":0},{"$f":"COUNTIF('Jan-Raw'!AP:AP,\"Justified\")","v":0},{"$f":"COUNTIF('Jan-Raw'!AR:AR,\"Justified\")","v":0},{"$f":"COUNTIF('Jan-Raw'!AT:AT,\"Justified\")","v":0},{"$f":"COUNTIF('Jan-Raw'!AV:AV,\"Justified\")","v":0},{"$f":"COUNTIF('Jan-Raw'!AX:AX,\"Justified\")","v":0},{"$f":"COUNTIF('Jan-Raw'!AZ:AZ,\"Justified\")","v":0},{"$f":"COUNTIF('Jan-Raw'!BB:BB,\"Justified\")","v":0},{"$f":"COUNTIF('Jan-Raw'!BD:BD,\"Justified\")","v":0},{"$f":"COUNTIF('Jan-Raw'!BF:BF,\"Justified\")","v":0},{"$f":"COUNTIF('Jan-Raw'!BH:BH,\"Justified\")","v":0},{"$f":"COUNTIF('Jan-Raw'!BJ:BJ,\"Justified\")","v":0},{"$f":"COUNTIF('Jan-Raw'!BL:BL,\"Justified\")","v":0},{"$f":"COUNTIF('Jan-Raw'!BN:BN,\"Justified\")","v":0},{"$f":"COUNTIF('Jan-Raw'!BP:BP,\"Justified\")","v":0},{"$f":"COUNTIF('Jan-Raw'!BR:BR,\"Justified\")","v":0},{"$f":"COUNTIF('Jan-Raw'!BT:BT,\"Justified\")","v":0},{"$f":"COUNTIF('Jan-Raw'!BV:BV,\"Justified\")","v":0},{"$f":"COUNTIF('Jan-Raw'!BX:BX,\"Justified\")","v":0},{"$f":"COUNTIF('Jan-Raw'!BZ:BZ,\"Justified\")","v":0},{"$f":"COUNTIF('Jan-Raw'!CB:CB,\"Justified\")","v":0},{"$f":"COUNTIF('Jan-Raw'!CD:CD,\"Justified\")","v":0},{"$f":"COUNTIF('Jan-Raw'!CF:CF,\"Justified\")","v":0},{"$f":"COUNTIF('Jan-Raw'!CH:CH,\"Justified\")","v":0}]
["Total NA",{"$f":"COUNTIF('Jan-Raw'!H:H,\"NA\")","v":0},{"$f":"COUNTIF('Jan-Raw'!J:J,\"NA\")","v":0},{"$f":"COUNTIF('Jan-Raw'!L:L,\"NA\")","v":0},{"$f":"COUNTIF('Jan-Raw'!N:N,\"NA\")","v":0},{"$f":"COUNTIF('Jan-Raw'!P:P,\"NA\")","v":0},{"$f":"COUNTIF('Jan-Raw'!R:R,\"NA\")","v":0},{"$f":"COUNTIF('Jan-Raw'!T:T,\"NA\")","v":0},{"$f":"COUNTIF('Jan-Raw'!V:V,\"NA\")","v":0},{"$f":"COUNTIF('Jan-Raw'!X:X,\"NA\")","v":0},{"$f":"COUNTIF('Jan-Raw'!Z:Z,\"NA\")","v":0},{"$f":"COUNTIF('Jan-Raw'!AB:AB,\"NA\")","v":0},{"$f":"COUNTIF('Jan-Raw'!AD:AD,\"NA\")","v":0},{"$f":"COUNTIF('Jan-Raw'!AF:AF,\"NA\")","v":0},{"$f":"COUNTIF('Jan-Raw'!AH:AH,\"NA\")","v":0},{"$f":"COUNTIF('Jan-Raw'!AJ:AJ,\"NA\")","v":0},{"$f":"COUNTIF('Jan-Raw'!AL:AL,\"NA\")","v":0},{"$f":"COUNTIF('Jan-Raw'!AN:AN,\"NA\")","v":0},{"$f":"COUNTIF('Jan-Raw'!AP:AP,\"NA\")","v":0},{"$f":"COUNTIF('Jan-Raw'!AR:AR,\"NA\")","v":0},{"$f":"COUNTIF('Jan-Raw'!AT:AT,\"NA\")","v":0},{"$f":"COUNTIF('Jan-Raw'!AV:AV,\"NA\")","v":0},{"$f":"COUNTIF('Jan-Raw'!AX:AX,\"NA\")","v":0},{"$f":"COUNTIF('Jan-Raw'!AZ:AZ,\"NA\")","v":0},{"$f":"COUNTIF('Jan-Raw'!BB:BB,\"NA\")","v":0},{"$f":"COUNTIF('Jan-Raw'!BD:BD,\"NA\")","v":0},{"$f":"COUNTIF('Jan-Raw'!BF:BF,\"NA\")","v":0},{"$f":"COUNTIF('Jan-Raw'!BH:BH,\"NA\")","v":0},{"$f":"COUNTIF('Jan-Raw'!BJ:BJ,\"NA\")","v":0},{"$f":"COUNTIF('Jan-Raw'!BL:BL,\"NA\")","v":0},{"$f":"COUNTIF('Jan-Raw'!BN:BN,\"NA\")","v":0},{"$f":"COUNTIF('Jan-Raw'!BP:BP,\"NA\")","v":0},{"$f":"COUNTIF('Jan-Raw'!BR:BR,\"NA\")","v":0},{"$f":"COUNTIF('Jan-Raw'!BT:BT,\"NA\")","v":0},{"$f":"COUNTIF('Jan-Raw'!BV:BV,\"NA\")","v":0},{"$f":"COUNTIF('Jan-Raw'!BX:BX,\"NA\")","v":0},{"$f":"COUNTIF('Jan-Raw'!BZ:BZ,\"NA\")","v":0},{"$f":"COUNTIF('Jan-Raw'!CB:CB,\"NA\")","v":0},{"$f":"COUNTIF('Jan-Raw'!CD:CD,\"NA\")","v":0},{"$f":"COUNTIF('Jan-Raw'!CF:CF,\"NA\")","v":0},{"$f":"COUNTIF('Jan-Raw'!CH:CH,\"NA\")","v":0}]
["Blanks",{"$f":"B8-(SUM(B3:B6))","v":0},{"$f":"C8-(SUM(C3:C6))","v":0},0,0,0,0,0,0,0,0,0,0,0,0,0,0,0,0,0,0,0,0,0,0,0,0,0,0,0,0,0,0,0,0,0,0,0,0,0,0]
["full sample size",{"$f":"COUNTA('Jan-Raw'!A:A)-2","v":0},{"$f":"B8","v":0},0,0,0,0,0,0,0,0,0,0,0,0,0,0,0,0,0,0,0,0,0,0,0,0,0,0,0,0,0,0,0,0,0,0,0,0,0,0]
["True sample size (-NA + blanks)",{"$f":"IF(ISERROR(B8-(B6+B7)),\"\",B8-(B6+B7))","v":0},{"$f":"IF(ISERROR(C8-(C6+C7)),\"\",C8-(C6+C7))","v":0},0,0,0,0,0,0,0,0,0,0,0,0,0,0,0,0,0,0,0,0,0,0,0,0,0,0,0,0,0,0,0,0,0,0,0,0,0,0]
["%Y",{"$f":"IF(ISERROR(B3/B9),\"\",B3/B9)","v":""},{"$f":"IF(ISERROR(C3/C9),\"\",C3/C9)","v":""},"","","","","","","","","","","","","","","","","","","","","","","","","","","","","","","","","","","","","",""]
["%N",{"$f":"IF(ISERROR(B4/B9),\"\",B4/B9)","v":""},{"$f":"IF(ISERROR(C4/C9),\"\",C4/C9)","v":""},"","","","","","","","","","","","","","","","","","","","","","","","","","","","","","","","","","","","","",""]
["%N - Justified",{"$f":"IF(ISERROR(B5/B9),\"\",B5/B9)","v":""},{"$f":"IF(ISERROR(C5/C9),\"\",C5/C9)","v":""},"","","","","","","","","","","","","","","","","","","","","","","","","","","","","","","","","","","","","",""]

{"sheet":"Feb","index":36,"n_rows":51,"n_cols":8,"rows_kept":51,"cut":false,"hidden":false,"merged":[]}
["Click here to go to year overview"]
[]
["Date",null,null,"Total by Apt type"]
["Completed by",null,null,"New",{"$f":"COUNTIF('feb-Raw'!E3:E103,\"New\")","v":0}]
["Sample group size",{"$f":"COUNTA('feb-Raw'!A:A)-2","v":0},null,"Follow up",{"$f":"COUNTIF('feb-Raw'!E3:E103,\"Fup\")","v":0},null,null,{"$f":"Year!H5","v":0.95}]
["Overall Result (compliant only)",{"$f":"IF(ISERROR(SUM(C11:C50)/G51),\"\",SUM(C11:C50)/G51)","v":""},null,"Total by apt Code",null,null,null,{"$f":"Year!H6","v":"80-95%"}]
["Overall Result (compliant & Justified)",{"$f":"IF(ISERROR(SUM(B11:B50)/G51),\"\",SUM(B11:B50)/G51)","v":""},null,"code goes in here",{"$f":"COUNTIF('feb-Raw'!F3:F103,D7)","v":0},null,null,{"$f":"Year!H7","v":0.8}]
["viable qs",{"$f":"G51","v":0}]
[]
["Metric","Compliant + Justified","Compliant","Justified","Not compliant","Irritating math"]
[{"$f":"IF(ISERROR('Audit questions'!A2),\"\",'Audit questions'!A2)","v":"Test1"},{"$f":"IF(ISERROR(C11+D11),\"\",C11+D11)","v":""},{"$f":"'feb-Data'!B10","v":""},{"$f":"'feb-Data'!B12","v":""},{"$f":"'feb-Data'!B11","v":""},{"$f":"COUNTIF(C11:E11,\">0\")","v":0}]
[{"$f":"IF(ISERROR('Audit questions'!A3),\"\",'Audit questions'!A3)","v":"Test2"},"",{"$f":"'feb-Data'!C10","v":""},{"$f":"'feb-Data'!C12","v":""},{"$f":"'feb-Data'!C11","v":""},0]
[{"$f":"IF(ISERROR('Audit questions'!A4),\"\",'Audit questions'!A4)","v":"Test3"},"",{"$f":"'feb-Data'!D10","v":""},{"$f":"'feb-Data'!D12","v":""},{"$f":"'feb-Data'!D11","v":""},0]
[{"$f":"IF(ISERROR('Audit questions'!A5),\"\",'Audit questions'!A5)","v":"Test4"},"",{"$f":"'feb-Data'!E10","v":""},{"$f":"'feb-Data'!E12","v":""},{"$f":"'feb-Data'!E11","v":""},0]
[{"$f":"IF(ISERROR('Audit questions'!A6),\"\",'Audit questions'!A6)","v":"Test5"},"",{"$f":"'feb-Data'!F10","v":""},{"$f":"'feb-Data'!F12","v":""},{"$f":"'feb-Data'!F11","v":""},0]
[{"$f":"IF(ISERROR('Audit questions'!A7),\"\",'Audit questions'!A7)","v":"Test6"},"",{"$f":"'feb-Data'!G10","v":""},{"$f":"'feb-Data'!G12","v":""},{"$f":"'feb-Data'!G11","v":""},0]
[{"$f":"IF(ISERROR('Audit questions'!A8),\"\",'Audit questions'!A8)","v":"Test7"},"",{"$f":"'feb-Data'!H10","v":""},{"$f":"'feb-Data'!H12","v":""},{"$f":"'feb-Data'!H11","v":""},0]
[{"$f":"IF(ISERROR('Audit questions'!A9),\"\",'Audit questions'!A9)","v":"Test8"},"",{"$f":"'feb-Data'!I10","v":""},{"$f":"'feb-Data'!I12","v":""},{"$f":"'feb-Data'!I11","v":""},0]
[{"$f":"IF(ISERROR('Audit questions'!A10),\"\",'Audit questions'!A10)","v":"Test9"},"",{"$f":"'feb-Data'!J10","v":""},{"$f":"'feb-Data'!J12","v":""},{"$f":"'feb-Data'!J11","v":""},0]
[{"$f":"IF(ISERROR('Audit questions'!A11),\"\",'Audit questions'!A11)","v":"Test10"},"",{"$f":"'feb-Data'!K10","v":""},{"$f":"'feb-Data'!K12","v":""},{"$f":"'feb-Data'!K11","v":""},0]
[{"$f":"IF(ISERROR('Audit questions'!A12),\"\",'Audit questions'!A12)","v":"Test11"},"",{"$f":"'feb-Data'!L10","v":""},{"$f":"'feb-Data'!L12","v":""},{"$f":"'feb-Data'!L11","v":""},0]
[{"$f":"IF(ISERROR('Audit questions'!A13),\"\",'Audit questions'!A13)","v":"Test12"},"",{"$f":"'feb-Data'!M10","v":""},{"$f":"'feb-Data'!M12","v":""},{"$f":"'feb-Data'!M11","v":""},0]
[{"$f":"IF(ISERROR('Audit questions'!A14),\"\",'Audit questions'!A14)","v":"Test13"},"",{"$f":"'feb-Data'!N10","v":""},{"$f":"'feb-Data'!N12","v":""},{"$f":"'feb-Data'!N11","v":""},0]
[{"$f":"IF(ISERROR('Audit questions'!A15),\"\",'Audit questions'!A15)","v":"Test14"},"",{"$f":"'feb-Data'!O10","v":""},{"$f":"'feb-Data'!O12","v":""},{"$f":"'feb-Data'!O11","v":""},0]
[{"$f":"IF(ISERROR('Audit questions'!A16),\"\",'Audit questions'!A16)","v":"Test15"},"",{"$f":"'feb-Data'!P10","v":""},{"$f":"'feb-Data'!P12","v":""},{"$f":"'feb-Data'!P11","v":""},0]
[{"$f":"IF(ISERROR('Audit questions'!A17),\"\",'Audit questions'!A17)","v":"Test16"},"",{"$f":"'feb-Data'!Q10","v":""},{"$f":"'feb-Data'!Q12","v":""},{"$f":"'feb-Data'!Q11","v":""},0]
[{"$f":"IF(ISERROR('Audit questions'!A18),\"\",'Audit questions'!A18)","v":"Test17"},"",{"$f":"'feb-Data'!R10","v":""},{"$f":"'feb-Data'!R12","v":""},{"$f":"'feb-Data'!R11","v":""},0]
[{"$f":"IF(ISERROR('Audit questions'!A19),\"\",'Audit questions'!A19)","v":"Test18"},"",{"$f":"'feb-Data'!S10","v":""},{"$f":"'feb-Data'!S12","v":""},{"$f":"'feb-Data'!S11","v":""},0]
[{"$f":"IF(ISERROR('Audit questions'!A20),\"\",'Audit questions'!A20)","v":"Test19"},"",{"$f":"'feb-Data'!T10","v":""},{"$f":"'feb-Data'!T12","v":""},{"$f":"'feb-Data'!T11","v":""},0]
[{"$f":"IF(ISERROR('Audit questions'!A21),\"\",'Audit questions'!A21)","v":"Test20"},"",{"$f":"'feb-Data'!U10","v":""},{"$f":"'feb-Data'!U12","v":""},{"$f":"'feb-Data'!U11","v":""},0]
[{"$f":"IF(ISERROR('Audit questions'!A22),\"\",'Audit questions'!A22)","v":"Test21"},"",{"$f":"'feb-Data'!V10","v":""},{"$f":"'feb-Data'!V12","v":""},{"$f":"'feb-Data'!V11","v":""},0]
[{"$f":"IF(ISERROR('Audit questions'!A23),\"\",'Audit questions'!A23)","v":"Test22"},"",{"$f":"'feb-Data'!W10","v":""},{"$f":"'feb-Data'!W12","v":""},{"$f":"'feb-Data'!W11","v":""},0]
[{"$f":"IF(ISERROR('Audit questions'!A24),\"\",'Audit questions'!A24)","v":"Test23"},"",{"$f":"'feb-Data'!X10","v":""},{"$f":"'feb-Data'!X12","v":""},{"$f":"'feb-Data'!X11","v":""},0]
[{"$f":"IF(ISERROR('Audit questions'!A25),\"\",'Audit questions'!A25)","v":"Test24"},"",{"$f":"'feb-Data'!Y10","v":""},{"$f":"'feb-Data'!Y12","v":""},{"$f":"'feb-Data'!Y11","v":""},0]
[{"$f":"IF(ISERROR('Audit questions'!A26),\"\",'Audit questions'!A26)","v":"Test25"},"",{"$f":"'feb-Data'!Z10","v":""},{"$f":"'feb-Data'!Z12","v":""},{"$f":"'feb-Data'!Z11","v":""},0]
[{"$f":"IF(ISERROR('Audit questions'!A27),\"\",'Audit questions'!A27)","v":"Test26"},"",{"$f":"'feb-Data'!AA10","v":""},{"$f":"'feb-Data'!AA12","v":""},{"$f":"'feb-Data'!AA11","v":""},0]
[{"$f":"IF(ISERROR('Audit questions'!A28),\"\",'Audit questions'!A28)","v":"Test27"},"",{"$f":"'feb-Data'!AB10","v":""},{"$f":"'feb-Data'!AB12","v":""},{"$f":"'feb-Data'!AB11","v":""},0]
[{"$f":"IF(ISERROR('Audit questions'!A29),\"\",'Audit questions'!A29)","v":"Test28"},"",{"$f":"'feb-Data'!AC10","v":""},{"$f":"'feb-Data'!AC12","v":""},{"$f":"'feb-Data'!AC11","v":""},0]
[{"$f":"IF(ISERROR('Audit questions'!A30),\"\",'Audit questions'!A30)","v":"Test29"},"",{"$f":"'feb-Data'!AD10","v":""},{"$f":"'feb-Data'!AD12","v":""},{"$f":"'feb-Data'!AD11","v":""},0]
[{"$f":"IF(ISERROR('Audit questions'!A31),\"\",'Audit questions'!A31)","v":"Test30"},"",{"$f":"'feb-Data'!AE10","v":""},{"$f":"'feb-Data'!AE12","v":""},{"$f":"'feb-Data'!AE11","v":""},0]
[{"$f":"IF(ISERROR('Audit questions'!A32),\"\",'Audit questions'!A32)","v":"Test31"},"",{"$f":"'feb-Data'!AF10","v":""},{"$f":"'feb-Data'!AF12","v":""},{"$f":"'feb-Data'!AF11","v":""},0]
[{"$f":"IF(ISERROR('Audit questions'!A33),\"\",'Audit questions'!A33)","v":"Test32"},"",{"$f":"'feb-Data'!AG10","v":""},{"$f":"'feb-Data'!AG12","v":""},{"$f":"'feb-Data'!AG11","v":""},0]
[{"$f":"IF(ISERROR('Audit questions'!A34),\"\",'Audit questions'!A34)","v":"Test33"},"",{"$f":"'feb-Data'!AH10","v":""},{"$f":"'feb-Data'!AH12","v":""},{"$f":"'feb-Data'!AH11","v":""},0]
[{"$f":"IF(ISERROR('Audit questions'!A35),\"\",'Audit questions'!A35)","v":"Test34"},"",{"$f":"'feb-Data'!AI10","v":""},{"$f":"'feb-Data'!AI12","v":""},{"$f":"'feb-Data'!AI11","v":""},0]
[{"$f":"IF(ISERROR('Audit questions'!A36),\"\",'Audit questions'!A36)","v":"Test35"},"",{"$f":"'feb-Data'!AJ10","v":""},{"$f":"'feb-Data'!AJ12","v":""},{"$f":"'feb-Data'!AJ11","v":""},0]
[{"$f":"IF(ISERROR('Audit questions'!A37),\"\",'Audit questions'!A37)","v":"Test36"},"",{"$f":"'feb-Data'!AK10","v":""},{"$f":"'feb-Data'!AK12","v":""},{"$f":"'feb-Data'!AK11","v":""},0]
[{"$f":"IF(ISERROR('Audit questions'!A38),\"\",'Audit questions'!A38)","v":"Test37"},"",{"$f":"'feb-Data'!AL10","v":""},{"$f":"'feb-Data'!AL12","v":""},{"$f":"'feb-Data'!AL11","v":""},0]
[{"$f":"IF(ISERROR('Audit questions'!A39),\"\",'Audit questions'!A39)","v":"Test38"},"",{"$f":"'feb-Data'!AM10","v":""},{"$f":"'feb-Data'!AM12","v":""},{"$f":"'feb-Data'!AM11","v":""},0]
[{"$f":"IF(ISERROR('Audit questions'!A40),\"\",'Audit questions'!A40)","v":"Test39"},"",{"$f":"'feb-Data'!AN10","v":""},{"$f":"'feb-Data'!AN12","v":""},{"$f":"'feb-Data'!AN11","v":""},0]
[{"$f":"IF(ISERROR('Audit questions'!A41),\"\",'Audit questions'!A41)","v":"Test40"},"",{"$f":"'feb-Data'!AO10","v":""},{"$f":"'feb-Data'!AO12","v":""},{"$f":"'feb-Data'!AO11","v":""},0]
[null,null,null,null,null,null,{"$f":"COUNTIF(F11:F50,\">=1\")","v":0}]

{"sheet":"feb-Raw","index":37,"n_rows":2,"n_cols":87,"rows_kept":2,"cut":false,"hidden":true,"merged":[[0,85,0,86],[0,63,0,64],[0,65,0,66],[0,67,0,68],[0,69,0,70],[0,71,0,72],[0,73,0,74],[0,75,0,76],[0,77,0,78],[0,79,0,80],[0,81,0,82],[0,83,0,84],[0,61,0,62],[0,39,0,40],[0,41,0,42],[0,43,0,44],[0,45,0,46],[0,47,0,48],[0,49,0,50],[0,51,0,52],[0,53,0,54],[0,55,0,56],[0,57,0,58],[0,59,0,60],[0,37,0,38],[0,15,0,16],[0,17,0,18],[0,19,0,20],[0,21,0,22],[0,23,0,24],[0,25,0,26],[0,27,0,28],[0,29,0,30],[0,31,0,32],[0,33,0,34],[0,35,0,36],[0,13,0,14],[0,0,0,5],[0,6,1,6],[0,7,0,8],[0,9,0,10],[0,11,0,12]]}
["Record details",null,null,null,null,null,"Notes",{"$f":"'Audit questions'!A2","v":"Test1"},null,{"$f":"'Audit questions'!A3","v":"Test2"},null,{"$f":"'Audit questions'!A4","v":"Test3"},null,{"$f":"'Audit questions'!A5","v":"Test4"},null,{"$f":"'Audit questions'!A6","v":"Test5"},null,{"$f":"'Audit questions'!A7","v":"Test6"},null,{"$f":"'Audit questions'!A8","v":"Test7"},null,{"$f":"'Audit questions'!A9","v":"Test8"},null,{"$f":"'Audit questions'!A10","v":"Test9"},null,{"$f":"'Audit questions'!A11","v":"Test10"},null,{"$f":"'Audit questions'!A12","v":"Test11"},null,{"$f":"'Audit questions'!A13","v":"Test12"},null,{"$f":"'Audit questions'!A14","v":"Test13"},null,{"$f":"'Audit questions'!A15","v":"Test14"},null,{"$f":"'Audit questions'!A16","v":"Test15"},null,{"$f":"'Audit questions'!A17","v":"Test16"},null,{"$f":"'Audit questions'!A18","v":"Test17"},null,{"$f":"'Audit questions'!A19","v":"Test18"},null,{"$f":"'Audit questions'!A20","v":"Test19"},null,{"$f":"'Audit questions'!A21","v":"Test20"},null,{"$f":"'Audit questions'!A22","v":"Test21"},null,{"$f":"'Audit questions'!A23","v":"Test22"},null,{"$f":"'Audit questions'!A24","v":"Test23"},null,{"$f":"'Audit questions'!A25","v":"Test24"},null,{"$f":"'Audit questions'!A26","v":"Test25"},null,{"$f":"'Audit questions'!A27","v":"Test26"},null,{"$f":"'Audit questions'!A28","v":"Test27"},null,{"$f":"'Audit questions'!A29","v":"Test28"},null,{"$f":"'Audit questions'!A30","v":"Test29"},null,{"$f":"'Audit questions'!A31","v":"Test30"},null,{"$f":"'Audit questions'!A32","v":"Test31"},null,{"$f":"'Audit questions'!A33","v":"Test32"},null,{"$f":"'Audit questions'!A34","v":"Test33"},null,{"$f":"'Audit questions'!A35","v":"Test34"},null,{"$f":"'Audit questions'!A36","v":"Test35"},null,{"$f":"'Audit questions'!A37","v":"Test36"},null,{"$f":"'Audit questions'!A38","v":"Test37"},null,{"$f":"'Audit questions'!A39","v":"Test38"},null,{"$f":"'Audit questions'!A40","v":"Test39"},null,{"$f":"'Audit questions'!A41","v":"Test40"}]
["Pt number","Date seen","Clinician 1","clinician 2","New/ F-up","Apt code",null,"Compliant?","Other result","Compliant?","Other result","Compliant?","Other result","Compliant?","Other result","Compliant?","Other result","Compliant?","Other result","Compliant?","Other result","Compliant?","Other result","Compliant?","Other result","Compliant?","Other result","Compliant?","Other result","Compliant?","Other result","Compliant?","Other result","Compliant?","Other result","Compliant?","Other result","Compliant?","Other result","Compliant?","Other result","Compliant?","Other result","Compliant?","Other result","Compliant?","Other result","Compliant?","Other result","Compliant?","Other result","Compliant?","Other result","Compliant?","Other result","Compliant?","Other result","Compliant?","Other result","Compliant?","Other result","Compliant?","Other result","Compliant?","Other result","Compliant?","Other result","Compliant?","Other result","Compliant?","Other result","Compliant?","Other result","Compliant?","Other result","Compliant?","Other result","Compliant?","Other result","Compliant?","Other result","Compliant?","Other result","Compliant?","Other result","Compliant?","Other result"]

{"sheet":"feb-Data","index":38,"n_rows":12,"n_cols":41,"rows_kept":12,"cut":false,"hidden":true,"merged":[[0,0,1,0]]}
["Results",{"$f":"'Audit questions'!A2","v":"Test1"},{"$f":"'Audit questions'!A3","v":"Test2"},{"$f":"'Audit questions'!A4","v":"Test3"},{"$f":"'Audit questions'!A5","v":"Test4"},{"$f":"'Audit questions'!A6","v":"Test5"},{"$f":"'Audit questions'!A7","v":"Test6"},{"$f":"'Audit questions'!A8","v":"Test7"},{"$f":"'Audit questions'!A9","v":"Test8"},{"$f":"'Audit questions'!A10","v":"Test9"},{"$f":"'Audit questions'!A11","v":"Test10"},{"$f":"'Audit questions'!A12","v":"Test11"},{"$f":"'Audit questions'!A13","v":"Test12"},{"$f":"'Audit questions'!A14","v":"Test13"},{"$f":"'Audit questions'!A15","v":"Test14"},{"$f":"'Audit questions'!A16","v":"Test15"},{"$f":"'Audit questions'!A17","v":"Test16"},{"$f":"'Audit questions'!A18","v":"Test17"},{"$f":"'Audit questions'!A19","v":"Test18"},{"$f":"'Audit questions'!A20","v":"Test19"},{"$f":"'Audit questions'!A21","v":"Test20"},{"$f":"'Audit questions'!A22","v":"Test21"},{"$f":"'Audit questions'!A23","v":"Test22"},{"$f":"'Audit questions'!A24","v":"Test23"},{"$f":"'Audit questions'!A25","v":"Test24"},{"$f":"'Audit questions'!A26","v":"Test25"},{"$f":"'Audit questions'!A27","v":"Test26"},{"$f":"'Audit questions'!A28","v":"Test27"},{"$f":"'Audit questions'!A29","v":"Test28"},{"$f":"'Audit questions'!A30","v":"Test29"},{"$f":"'Audit questions'!A31","v":"Test30"},{"$f":"'Audit questions'!A32","v":"Test31"},{"$f":"'Audit questions'!A33","v":"Test32"},{"$f":"'Audit questions'!A34","v":"Test33"},{"$f":"'Audit questions'!A35","v":"Test34"},{"$f":"'Audit questions'!A36","v":"Test35"},{"$f":"'Audit questions'!A37","v":"Test36"},{"$f":"'Audit questions'!A38","v":"Test37"},{"$f":"'Audit questions'!A39","v":"Test38"},{"$f":"'Audit questions'!A40","v":"Test39"},{"$f":"'Audit questions'!A41","v":"Test40"}]
[null,"Compliant?","Compliant?","Compliant?","Compliant?","Compliant?","Compliant?","Compliant?","Compliant?","Compliant?","Compliant?","Compliant?","Compliant?","Compliant?","Compliant?","Compliant?","Compliant?","Compliant?","Compliant?","Compliant?","Compliant?","Compliant?","Compliant?","Compliant?","Compliant?","Compliant?","Compliant?","Compliant?","Compliant?","Compliant?","Compliant?","Compliant?","Compliant?","Compliant?","Compliant?","Compliant?","Compliant?","Compliant?","Compliant?","Compliant?","Compliant?"]
["Total Y",{"$f":"COUNTIF('feb-Raw'!H:H,\"yes\")","v":0},{"$f":"COUNTIF('feb-Raw'!J:J,\"yes\")","v":0},{"$f":"COUNTIF('feb-Raw'!L:L,\"yes\")","v":0},{"$f":"COUNTIF('feb-Raw'!N:N,\"yes\")","v":0},{"$f":"COUNTIF('feb-Raw'!P:P,\"yes\")","v":0},{"$f":"COUNTIF('feb-Raw'!R:R,\"yes\")","v":0},{"$f":"COUNTIF('feb-Raw'!T:T,\"yes\")","v":0},{"$f":"COUNTIF('feb-Raw'!V:V,\"yes\")","v":0},{"$f":"COUNTIF('feb-Raw'!X:X,\"yes\")","v":0},{"$f":"COUNTIF('feb-Raw'!Z:Z,\"yes\")","v":0},{"$f":"COUNTIF('feb-Raw'!AB:AB,\"yes\")","v":0},{"$f":"COUNTIF('feb-Raw'!AD:AD,\"yes\")","v":0},{"$f":"COUNTIF('feb-Raw'!AF:AF,\"yes\")","v":0},{"$f":"COUNTIF('feb-Raw'!AH:AH,\"yes\")","v":0},{"$f":"COUNTIF('feb-Raw'!AJ:AJ,\"yes\")","v":0},{"$f":"COUNTIF('feb-Raw'!AL:AL,\"yes\")","v":0},{"$f":"COUNTIF('feb-Raw'!AN:AN,\"yes\")","v":0},{"$f":"COUNTIF('feb-Raw'!AP:AP,\"yes\")","v":0},{"$f":"COUNTIF('feb-Raw'!AR:AR,\"yes\")","v":0},{"$f":"COUNTIF('feb-Raw'!AT:AT,\"yes\")","v":0},{"$f":"COUNTIF('feb-Raw'!AV:AV,\"yes\")","v":0},{"$f":"COUNTIF('feb-Raw'!AX:AX,\"yes\")","v":0},{"$f":"COUNTIF('feb-Raw'!AZ:AZ,\"yes\")","v":0},{"$f":"COUNTIF('feb-Raw'!BB:BB,\"yes\")","v":0},{"$f":"COUNTIF('feb-Raw'!BD:BD,\"yes\")","v":0},{"$f":"COUNTIF('feb-Raw'!BF:BF,\"yes\")","v":0},{"$f":"COUNTIF('feb-Raw'!BH:BH,\"yes\")","v":0},{"$f":"COUNTIF('feb-Raw'!BJ:BJ,\"yes\")","v":0},{"$f":"COUNTIF('feb-Raw'!BL:BL,\"yes\")","v":0},{"$f":"COUNTIF('feb-Raw'!BN:BN,\"yes\")","v":0},{"$f":"COUNTIF('feb-Raw'!BP:BP,\"yes\")","v":0},{"$f":"COUNTIF('feb-Raw'!BR:BR,\"yes\")","v":0},{"$f":"COUNTIF('feb-Raw'!BT:BT,\"yes\")","v":0},{"$f":"COUNTIF('feb-Raw'!BV:BV,\"yes\")","v":0},{"$f":"COUNTIF('feb-Raw'!BX:BX,\"yes\")","v":0},{"$f":"COUNTIF('feb-Raw'!BZ:BZ,\"yes\")","v":0},{"$f":"COUNTIF('feb-Raw'!CB:CB,\"yes\")","v":0},{"$f":"COUNTIF('feb-Raw'!CD:CD,\"yes\")","v":0},{"$f":"COUNTIF('feb-Raw'!CF:CF,\"yes\")","v":0},{"$f":"COUNTIF('feb-Raw'!CH:CH,\"yes\")","v":0}]
["Total N",{"$f":"COUNTIF('feb-Raw'!H:H,\"no\")","v":0},{"$f":"COUNTIF('feb-Raw'!J:J,\"no\")","v":0},{"$f":"COUNTIF('feb-Raw'!L:L,\"no\")","v":0},{"$f":"COUNTIF('feb-Raw'!N:N,\"no\")","v":0},{"$f":"COUNTIF('feb-Raw'!P:P,\"no\")","v":0},{"$f":"COUNTIF('feb-Raw'!R:R,\"no\")","v":0},{"$f":"COUNTIF('feb-Raw'!T:T,\"no\")","v":0},{"$f":"COUNTIF('feb-Raw'!V:V,\"no\")","v":0},{"$f":"COUNTIF('feb-Raw'!X:X,\"no\")","v":0},{"$f":"COUNTIF('feb-Raw'!Z:Z,\"no\")","v":0},{"$f":"COUNTIF('feb-Raw'!AB:AB,\"no\")","v":0},{"$f":"COUNTIF('feb-Raw'!AD:AD,\"no\")","v":0},{"$f":"COUNTIF('feb-Raw'!AF:AF,\"no\")","v":0},{"$f":"COUNTIF('feb-Raw'!AH:AH,\"no\")","v":0},{"$f":"COUNTIF('feb-Raw'!AJ:AJ,\"no\")","v":0},{"$f":"COUNTIF('feb-Raw'!AL:AL,\"no\")","v":0},{"$f":"COUNTIF('feb-Raw'!AN:AN,\"no\")","v":0},{"$f":"COUNTIF('feb-Raw'!AP:AP,\"no\")","v":0},{"$f":"COUNTIF('feb-Raw'!AR:AR,\"no\")","v":0},{"$f":"COUNTIF('feb-Raw'!AT:AT,\"no\")","v":0},{"$f":"COUNTIF('feb-Raw'!AV:AV,\"no\")","v":0},{"$f":"COUNTIF('feb-Raw'!AX:AX,\"no\")","v":0},{"$f":"COUNTIF('feb-Raw'!AZ:AZ,\"no\")","v":0},{"$f":"COUNTIF('feb-Raw'!BB:BB,\"no\")","v":0},{"$f":"COUNTIF('feb-Raw'!BD:BD,\"no\")","v":0},{"$f":"COUNTIF('feb-Raw'!BF:BF,\"no\")","v":0},{"$f":"COUNTIF('feb-Raw'!BH:BH,\"no\")","v":0},{"$f":"COUNTIF('feb-Raw'!BJ:BJ,\"no\")","v":0},{"$f":"COUNTIF('feb-Raw'!BL:BL,\"no\")","v":0},{"$f":"COUNTIF('feb-Raw'!BN:BN,\"no\")","v":0},{"$f":"COUNTIF('feb-Raw'!BP:BP,\"no\")","v":0},{"$f":"COUNTIF('feb-Raw'!BR:BR,\"no\")","v":0},{"$f":"COUNTIF('feb-Raw'!BT:BT,\"no\")","v":0},{"$f":"COUNTIF('feb-Raw'!BV:BV,\"no\")","v":0},{"$f":"COUNTIF('feb-Raw'!BX:BX,\"no\")","v":0},{"$f":"COUNTIF('feb-Raw'!BZ:BZ,\"no\")","v":0},{"$f":"COUNTIF('feb-Raw'!CB:CB,\"no\")","v":0},{"$f":"COUNTIF('feb-Raw'!CD:CD,\"no\")","v":0},{"$f":"COUNTIF('feb-Raw'!CF:CF,\"no\")","v":0},{"$f":"COUNTIF('feb-Raw'!CH:CH,\"no\")","v":0}]
["Total Justified",{"$f":"COUNTIF('feb-Raw'!H:H,\"Justified\")","v":0},{"$f":"COUNTIF('feb-Raw'!J:J,\"Justified\")","v":0},{"$f":"COUNTIF('feb-Raw'!L:L,\"Justified\")","v":0},{"$f":"COUNTIF('feb-Raw'!N:N,\"Justified\")","v":0},{"$f":"COUNTIF('feb-Raw'!P:P,\"Justified\")","v":0},{"$f":"COUNTIF('feb-Raw'!R:R,\"Justified\")","v":0},{"$f":"COUNTIF('feb-Raw'!T:T,\"Justified\")","v":0},{"$f":"COUNTIF('feb-Raw'!V:V,\"Justified\")","v":0},{"$f":"COUNTIF('feb-Raw'!X:X,\"Justified\")","v":0},{"$f":"COUNTIF('feb-Raw'!Z:Z,\"Justified\")","v":0},{"$f":"COUNTIF('feb-Raw'!AB:AB,\"Justified\")","v":0},{"$f":"COUNTIF('feb-Raw'!AD:AD,\"Justified\")","v":0},{"$f":"COUNTIF('feb-Raw'!AF:AF,\"Justified\")","v":0},{"$f":"COUNTIF('feb-Raw'!AH:AH,\"Justified\")","v":0},{"$f":"COUNTIF('feb-Raw'!AJ:AJ,\"Justified\")","v":0},{"$f":"COUNTIF('feb-Raw'!AL:AL,\"Justified\")","v":0},{"$f":"COUNTIF('feb-Raw'!AN:AN,\"Justified\")","v":0},{"$f":"COUNTIF('feb-Raw'!AP:AP,\"Justified\")","v":0},{"$f":"COUNTIF('feb-Raw'!AR:AR,\"Justified\")","v":0},{"$f":"COUNTIF('feb-Raw'!AT:AT,\"Justified\")","v":0},{"$f":"COUNTIF('feb-Raw'!AV:AV,\"Justified\")","v":0},{"$f":"COUNTIF('feb-Raw'!AX:AX,\"Justified\")","v":0},{"$f":"COUNTIF('feb-Raw'!AZ:AZ,\"Justified\")","v":0},{"$f":"COUNTIF('feb-Raw'!BB:BB,\"Justified\")","v":0},{"$f":"COUNTIF('feb-Raw'!BD:BD,\"Justified\")","v":0},{"$f":"COUNTIF('feb-Raw'!BF:BF,\"Justified\")","v":0},{"$f":"COUNTIF('feb-Raw'!BH:BH,\"Justified\")","v":0},{"$f":"COUNTIF('feb-Raw'!BJ:BJ,\"Justified\")","v":0},{"$f":"COUNTIF('feb-Raw'!BL:BL,\"Justified\")","v":0},{"$f":"COUNTIF('feb-Raw'!BN:BN,\"Justified\")","v":0},{"$f":"COUNTIF('feb-Raw'!BP:BP,\"Justified\")","v":0},{"$f":"COUNTIF('feb-Raw'!BR:BR,\"Justified\")","v":0},{"$f":"COUNTIF('feb-Raw'!BT:BT,\"Justified\")","v":0},{"$f":"COUNTIF('feb-Raw'!BV:BV,\"Justified\")","v":0},{"$f":"COUNTIF('feb-Raw'!BX:BX,\"Justified\")","v":0},{"$f":"COUNTIF('feb-Raw'!BZ:BZ,\"Justified\")","v":0},{"$f":"COUNTIF('feb-Raw'!CB:CB,\"Justified\")","v":0},{"$f":"COUNTIF('feb-Raw'!CD:CD,\"Justified\")","v":0},{"$f":"COUNTIF('feb-Raw'!CF:CF,\"Justified\")","v":0},{"$f":"COUNTIF('feb-Raw'!CH:CH,\"Justified\")","v":0}]
["Total NA",{"$f":"COUNTIF('feb-Raw'!H:H,\"NA\")","v":0},{"$f":"COUNTIF('feb-Raw'!J:J,\"NA\")","v":0},{"$f":"COUNTIF('feb-Raw'!L:L,\"NA\")","v":0},{"$f":"COUNTIF('feb-Raw'!N:N,\"NA\")","v":0},{"$f":"COUNTIF('feb-Raw'!P:P,\"NA\")","v":0},{"$f":"COUNTIF('feb-Raw'!R:R,\"NA\")","v":0},{"$f":"COUNTIF('feb-Raw'!T:T,\"NA\")","v":0},{"$f":"COUNTIF('feb-Raw'!V:V,\"NA\")","v":0},{"$f":"COUNTIF('feb-Raw'!X:X,\"NA\")","v":0},{"$f":"COUNTIF('feb-Raw'!Z:Z,\"NA\")","v":0},{"$f":"COUNTIF('feb-Raw'!AB:AB,\"NA\")","v":0},{"$f":"COUNTIF('feb-Raw'!AD:AD,\"NA\")","v":0},{"$f":"COUNTIF('feb-Raw'!AF:AF,\"NA\")","v":0},{"$f":"COUNTIF('feb-Raw'!AH:AH,\"NA\")","v":0},{"$f":"COUNTIF('feb-Raw'!AJ:AJ,\"NA\")","v":0},{"$f":"COUNTIF('feb-Raw'!AL:AL,\"NA\")","v":0},{"$f":"COUNTIF('feb-Raw'!AN:AN,\"NA\")","v":0},{"$f":"COUNTIF('feb-Raw'!AP:AP,\"NA\")","v":0},{"$f":"COUNTIF('feb-Raw'!AR:AR,\"NA\")","v":0},{"$f":"COUNTIF('feb-Raw'!AT:AT,\"NA\")","v":0},{"$f":"COUNTIF('feb-Raw'!AV:AV,\"NA\")","v":0},{"$f":"COUNTIF('feb-Raw'!AX:AX,\"NA\")","v":0},{"$f":"COUNTIF('feb-Raw'!AZ:AZ,\"NA\")","v":0},{"$f":"COUNTIF('feb-Raw'!BB:BB,\"NA\")","v":0},{"$f":"COUNTIF('feb-Raw'!BD:BD,\"NA\")","v":0},{"$f":"COUNTIF('feb-Raw'!BF:BF,\"NA\")","v":0},{"$f":"COUNTIF('feb-Raw'!BH:BH,\"NA\")","v":0},{"$f":"COUNTIF('feb-Raw'!BJ:BJ,\"NA\")","v":0},{"$f":"COUNTIF('feb-Raw'!BL:BL,\"NA\")","v":0},{"$f":"COUNTIF('feb-Raw'!BN:BN,\"NA\")","v":0},{"$f":"COUNTIF('feb-Raw'!BP:BP,\"NA\")","v":0},{"$f":"COUNTIF('feb-Raw'!BR:BR,\"NA\")","v":0},{"$f":"COUNTIF('feb-Raw'!BT:BT,\"NA\")","v":0},{"$f":"COUNTIF('feb-Raw'!BV:BV,\"NA\")","v":0},{"$f":"COUNTIF('feb-Raw'!BX:BX,\"NA\")","v":0},{"$f":"COUNTIF('feb-Raw'!BZ:BZ,\"NA\")","v":0},{"$f":"COUNTIF('feb-Raw'!CB:CB,\"NA\")","v":0},{"$f":"COUNTIF('feb-Raw'!CD:CD,\"NA\")","v":0},{"$f":"COUNTIF('feb-Raw'!CF:CF,\"NA\")","v":0},{"$f":"COUNTIF('feb-Raw'!CH:CH,\"NA\")","v":0}]
["Blanks",{"$f":"B8-(SUM(B3:B6))","v":0},{"$f":"C8-(SUM(C3:C6))","v":0},0,0,0,0,0,0,0,0,0,0,0,0,0,0,0,0,0,0,0,0,0,0,0,0,0,0,0,0,0,0,0,0,0,0,0,0,0,0]
["full sample size",{"$f":"COUNTA('feb-Raw'!A:A)-2","v":0},{"$f":"B8","v":0},0,0,0,0,0,0,0,0,0,0,0,0,0,0,0,0,0,0,0,0,0,0,0,0,0,0,0,0,0,0,0,0,0,0,0,0,0,0]
["True sample size (-NA + blanks)",{"$f":"IF(ISERROR(B8-(B6+B7)),\"\",B8-(B6+B7))","v":0},{"$f":"IF(ISERROR(C8-(C6+C7)),\"\",C8-(C6+C7))","v":0},0,0,0,0,0,0,0,0,0,0,0,0,0,0,0,0,0,0,0,0,0,0,0,0,0,0,0,0,0,0,0,0,0,0,0,0,0,0]
["%Y",{"$f":"IF(ISERROR(B3/B9),\"\",B3/B9)","v":""},{"$f":"IF(ISERROR(C3/C9),\"\",C3/C9)","v":""},"","","","","","","","","","","","","","","","","","","","","","","","","","","","","","","","","","","","","",""]
["%N",{"$f":"IF(ISERROR(B4/B9),\"\",B4/B9)","v":""},{"$f":"IF(ISERROR(C4/C9),\"\",C4/C9)","v":""},"","","","","","","","","","","","","","","","","","","","","","","","","","","","","","","","","","","","","",""]
["%N - Justified",{"$f":"IF(ISERROR(B5/B9),\"\",B5/B9)","v":""},{"$f":"IF(ISERROR(C5/C9),\"\",C5/C9)","v":""},"","","","","","","","","","","","","","","","","","","","","","","","","","","","","","","","","","","","","",""]

{"sheet":"March","index":39,"n_rows":51,"n_cols":8,"rows_kept":51,"cut":false,"hidden":false,"merged":[]}
["Click here to go to year overview"]
[]
["Date",null,null,"Total by Apt type"]
["Completed by",null,null,"New",{"$f":"COUNTIF('march-Raw'!E3:E103,\"New\")","v":0}]
["Sample group size",{"$f":"COUNTA('march-Raw'!A:A)-2","v":0},null,"Follow up",{"$f":"COUNTIF('march-Raw'!E3:E103,\"Fup\")","v":0},null,null,{"$f":"Year!H5","v":0.95}]
["Overall Result (compliant only)",{"$f":"IF(ISERROR(SUM(C11:C50)/G51),\"\",SUM(C11:C50)/G51)","v":""},null,"Total by apt Code",null,null,null,{"$f":"Year!H6","v":"80-95%"}]
["Overall Result (compliant & Justified)",{"$f":"IF(ISERROR(SUM(B11:B50)/G51),\"\",SUM(B11:B50)/G51)","v":""},null,"code goes in here",{"$f":"COUNTIF('march-Raw'!F3:F103,D7)","v":0},null,null,{"$f":"Year!H7","v":0.8}]
["viable qs",{"$f":"G51","v":0}]
[]
["Metric","Compliant + Justified","Compliant","Justified","Not compliant","Irritating math"]
[{"$f":"IF(ISERROR('Audit questions'!A2),\"\",'Audit questions'!A2)","v":"Test1"},{"$f":"IF(ISERROR(C11+D11),\"\",C11+D11)","v":""},{"$f":"'march-Data'!B10","v":""},{"$f":"'march-Data'!B12","v":""},{"$f":"'march-Data'!B11","v":""},{"$f":"COUNTIF(C11:E11,\">0\")","v":0}]
[{"$f":"IF(ISERROR('Audit questions'!A3),\"\",'Audit questions'!A3)","v":"Test2"},"",{"$f":"'march-Data'!C10","v":""},{"$f":"'march-Data'!C12","v":""},{"$f":"'march-Data'!C11","v":""},0]
[{"$f":"IF(ISERROR('Audit questions'!A4),\"\",'Audit questions'!A4)","v":"Test3"},"",{"$f":"'march-Data'!D10","v":""},{"$f":"'march-Data'!D12","v":""},{"$f":"'march-Data'!D11","v":""},0]
[{"$f":"IF(ISERROR('Audit questions'!A5),\"\",'Audit questions'!A5)","v":"Test4"},"",{"$f":"'march-Data'!E10","v":""},{"$f":"'march-Data'!E12","v":""},{"$f":"'march-Data'!E11","v":""},0]
[{"$f":"IF(ISERROR('Audit questions'!A6),\"\",'Audit questions'!A6)","v":"Test5"},"",{"$f":"'march-Data'!F10","v":""},{"$f":"'march-Data'!F12","v":""},{"$f":"'march-Data'!F11","v":""},0]
[{"$f":"IF(ISERROR('Audit questions'!A7),\"\",'Audit questions'!A7)","v":"Test6"},"",{"$f":"'march-Data'!G10","v":""},{"$f":"'march-Data'!G12","v":""},{"$f":"'march-Data'!G11","v":""},0]
[{"$f":"IF(ISERROR('Audit questions'!A8),\"\",'Audit questions'!A8)","v":"Test7"},"",{"$f":"'march-Data'!H10","v":""},{"$f":"'march-Data'!H12","v":""},{"$f":"'march-Data'!H11","v":""},0]
[{"$f":"IF(ISERROR('Audit questions'!A9),\"\",'Audit questions'!A9)","v":"Test8"},"",{"$f":"'march-Data'!I10","v":""},{"$f":"'march-Data'!I12","v":""},{"$f":"'march-Data'!I11","v":""},0]
[{"$f":"IF(ISERROR('Audit questions'!A10),\"\",'Audit questions'!A10)","v":"Test9"},"",{"$f":"'march-Data'!J10","v":""},{"$f":"'march-Data'!J12","v":""},{"$f":"'march-Data'!J11","v":""},0]
[{"$f":"IF(ISERROR('Audit questions'!A11),\"\",'Audit questions'!A11)","v":"Test10"},"",{"$f":"'march-Data'!K10","v":""},{"$f":"'march-Data'!K12","v":""},{"$f":"'march-Data'!K11","v":""},0]
[{"$f":"IF(ISERROR('Audit questions'!A12),\"\",'Audit questions'!A12)","v":"Test11"},"",{"$f":"'march-Data'!L10","v":""},{"$f":"'march-Data'!L12","v":""},{"$f":"'march-Data'!L11","v":""},0]
[{"$f":"IF(ISERROR('Audit questions'!A13),\"\",'Audit questions'!A13)","v":"Test12"},"",{"$f":"'march-Data'!M10","v":""},{"$f":"'march-Data'!M12","v":""},{"$f":"'march-Data'!M11","v":""},0]
[{"$f":"IF(ISERROR('Audit questions'!A14),\"\",'Audit questions'!A14)","v":"Test13"},"",{"$f":"'march-Data'!N10","v":""},{"$f":"'march-Data'!N12","v":""},{"$f":"'march-Data'!N11","v":""},0]
[{"$f":"IF(ISERROR('Audit questions'!A15),\"\",'Audit questions'!A15)","v":"Test14"},"",{"$f":"'march-Data'!O10","v":""},{"$f":"'march-Data'!O12","v":""},{"$f":"'march-Data'!O11","v":""},0]
[{"$f":"IF(ISERROR('Audit questions'!A16),\"\",'Audit questions'!A16)","v":"Test15"},"",{"$f":"'march-Data'!P10","v":""},{"$f":"'march-Data'!P12","v":""},{"$f":"'march-Data'!P11","v":""},0]
[{"$f":"IF(ISERROR('Audit questions'!A17),\"\",'Audit questions'!A17)","v":"Test16"},"",{"$f":"'march-Data'!Q10","v":""},{"$f":"'march-Data'!Q12","v":""},{"$f":"'march-Data'!Q11","v":""},0]
[{"$f":"IF(ISERROR('Audit questions'!A18),\"\",'Audit questions'!A18)","v":"Test17"},"",{"$f":"'march-Data'!R10","v":""},{"$f":"'march-Data'!R12","v":""},{"$f":"'march-Data'!R11","v":""},0]
[{"$f":"IF(ISERROR('Audit questions'!A19),\"\",'Audit questions'!A19)","v":"Test18"},"",{"$f":"'march-Data'!S10","v":""},{"$f":"'march-Data'!S12","v":""},{"$f":"'march-Data'!S11","v":""},0]
[{"$f":"IF(ISERROR('Audit questions'!A20),\"\",'Audit questions'!A20)","v":"Test19"},"",{"$f":"'march-Data'!T10","v":""},{"$f":"'march-Data'!T12","v":""},{"$f":"'march-Data'!T11","v":""},0]
[{"$f":"IF(ISERROR('Audit questions'!A21),\"\",'Audit questions'!A21)","v":"Test20"},"",{"$f":"'march-Data'!U10","v":""},{"$f":"'march-Data'!U12","v":""},{"$f":"'march-Data'!U11","v":""},0]
[{"$f":"IF(ISERROR('Audit questions'!A22),\"\",'Audit questions'!A22)","v":"Test21"},"",{"$f":"'march-Data'!V10","v":""},{"$f":"'march-Data'!V12","v":""},{"$f":"'march-Data'!V11","v":""},0]
[{"$f":"IF(ISERROR('Audit questions'!A23),\"\",'Audit questions'!A23)","v":"Test22"},"",{"$f":"'march-Data'!W10","v":""},{"$f":"'march-Data'!W12","v":""},{"$f":"'march-Data'!W11","v":""},0]
[{"$f":"IF(ISERROR('Audit questions'!A24),\"\",'Audit questions'!A24)","v":"Test23"},"",{"$f":"'march-Data'!X10","v":""},{"$f":"'march-Data'!X12","v":""},{"$f":"'march-Data'!X11","v":""},0]
[{"$f":"IF(ISERROR('Audit questions'!A25),\"\",'Audit questions'!A25)","v":"Test24"},"",{"$f":"'march-Data'!Y10","v":""},{"$f":"'march-Data'!Y12","v":""},{"$f":"'march-Data'!Y11","v":""},0]
[{"$f":"IF(ISERROR('Audit questions'!A26),\"\",'Audit questions'!A26)","v":"Test25"},"",{"$f":"'march-Data'!Z10","v":""},{"$f":"'march-Data'!Z12","v":""},{"$f":"'march-Data'!Z11","v":""},0]
[{"$f":"IF(ISERROR('Audit questions'!A27),\"\",'Audit questions'!A27)","v":"Test26"},"",{"$f":"'march-Data'!AA10","v":""},{"$f":"'march-Data'!AA12","v":""},{"$f":"'march-Data'!AA11","v":""},0]
[{"$f":"IF(ISERROR('Audit questions'!A28),\"\",'Audit questions'!A28)","v":"Test27"},"",{"$f":"'march-Data'!AB10","v":""},{"$f":"'march-Data'!AB12","v":""},{"$f":"'march-Data'!AB11","v":""},0]
[{"$f":"IF(ISERROR('Audit questions'!A29),\"\",'Audit questions'!A29)","v":"Test28"},"",{"$f":"'march-Data'!AC10","v":""},{"$f":"'march-Data'!AC12","v":""},{"$f":"'march-Data'!AC11","v":""},0]
[{"$f":"IF(ISERROR('Audit questions'!A30),\"\",'Audit questions'!A30)","v":"Test29"},"",{"$f":"'march-Data'!AD10","v":""},{"$f":"'march-Data'!AD12","v":""},{"$f":"'march-Data'!AD11","v":""},0]
[{"$f":"IF(ISERROR('Audit questions'!A31),\"\",'Audit questions'!A31)","v":"Test30"},"",{"$f":"'march-Data'!AE10","v":""},{"$f":"'march-Data'!AE12","v":""},{"$f":"'march-Data'!AE11","v":""},0]
[{"$f":"IF(ISERROR('Audit questions'!A32),\"\",'Audit questions'!A32)","v":"Test31"},"",{"$f":"'march-Data'!AF10","v":""},{"$f":"'march-Data'!AF12","v":""},{"$f":"'march-Data'!AF11","v":""},0]
[{"$f":"IF(ISERROR('Audit questions'!A33),\"\",'Audit questions'!A33)","v":"Test32"},"",{"$f":"'march-Data'!AG10","v":""},{"$f":"'march-Data'!AG12","v":""},{"$f":"'march-Data'!AG11","v":""},0]
[{"$f":"IF(ISERROR('Audit questions'!A34),\"\",'Audit questions'!A34)","v":"Test33"},"",{"$f":"'march-Data'!AH10","v":""},{"$f":"'march-Data'!AH12","v":""},{"$f":"'march-Data'!AH11","v":""},0]
[{"$f":"IF(ISERROR('Audit questions'!A35),\"\",'Audit questions'!A35)","v":"Test34"},"",{"$f":"'march-Data'!AI10","v":""},{"$f":"'march-Data'!AI12","v":""},{"$f":"'march-Data'!AI11","v":""},0]
[{"$f":"IF(ISERROR('Audit questions'!A36),\"\",'Audit questions'!A36)","v":"Test35"},"",{"$f":"'march-Data'!AJ10","v":""},{"$f":"'march-Data'!AJ12","v":""},{"$f":"'march-Data'!AJ11","v":""},0]
[{"$f":"IF(ISERROR('Audit questions'!A37),\"\",'Audit questions'!A37)","v":"Test36"},"",{"$f":"'march-Data'!AK10","v":""},{"$f":"'march-Data'!AK12","v":""},{"$f":"'march-Data'!AK11","v":""},0]
[{"$f":"IF(ISERROR('Audit questions'!A38),\"\",'Audit questions'!A38)","v":"Test37"},"",{"$f":"'march-Data'!AL10","v":""},{"$f":"'march-Data'!AL12","v":""},{"$f":"'march-Data'!AL11","v":""},0]
[{"$f":"IF(ISERROR('Audit questions'!A39),\"\",'Audit questions'!A39)","v":"Test38"},"",{"$f":"'march-Data'!AM10","v":""},{"$f":"'march-Data'!AM12","v":""},{"$f":"'march-Data'!AM11","v":""},0]
[{"$f":"IF(ISERROR('Audit questions'!A40),\"\",'Audit questions'!A40)","v":"Test39"},"",{"$f":"'march-Data'!AN10","v":""},{"$f":"'march-Data'!AN12","v":""},{"$f":"'march-Data'!AN11","v":""},0]
[{"$f":"IF(ISERROR('Audit questions'!A41),\"\",'Audit questions'!A41)","v":"Test40"},"",{"$f":"'march-Data'!AO10","v":""},{"$f":"'march-Data'!AO12","v":""},{"$f":"'march-Data'!AO11","v":""},0]
[null,null,null,null,null,null,{"$f":"COUNTIF(F11:F50,\">=1\")","v":0}]

{"sheet":"march-Raw","index":40,"n_rows":2,"n_cols":87,"rows_kept":2,"cut":false,"hidden":true,"merged":[[0,85,0,86],[0,63,0,64],[0,65,0,66],[0,67,0,68],[0,69,0,70],[0,71,0,72],[0,73,0,74],[0,75,0,76],[0,77,0,78],[0,79,0,80],[0,81,0,82],[0,83,0,84],[0,61,0,62],[0,39,0,40],[0,41,0,42],[0,43,0,44],[0,45,0,46],[0,47,0,48],[0,49,0,50],[0,51,0,52],[0,53,0,54],[0,55,0,56],[0,57,0,58],[0,59,0,60],[0,37,0,38],[0,15,0,16],[0,17,0,18],[0,19,0,20],[0,21,0,22],[0,23,0,24],[0,25,0,26],[0,27,0,28],[0,29,0,30],[0,31,0,32],[0,33,0,34],[0,35,0,36],[0,13,0,14],[0,0,0,5],[0,6,1,6],[0,7,0,8],[0,9,0,10],[0,11,0,12]]}
["Record details",null,null,null,null,null,"Notes",{"$f":"'Audit questions'!A2","v":"Test1"},null,{"$f":"'Audit questions'!A3","v":"Test2"},null,{"$f":"'Audit questions'!A4","v":"Test3"},null,{"$f":"'Audit questions'!A5","v":"Test4"},null,{"$f":"'Audit questions'!A6","v":"Test5"},null,{"$f":"'Audit questions'!A7","v":"Test6"},null,{"$f":"'Audit questions'!A8","v":"Test7"},null,{"$f":"'Audit questions'!A9","v":"Test8"},null,{"$f":"'Audit questions'!A10","v":"Test9"},null,{"$f":"'Audit questions'!A11","v":"Test10"},null,{"$f":"'Audit questions'!A12","v":"Test11"},null,{"$f":"'Audit questions'!A13","v":"Test12"},null,{"$f":"'Audit questions'!A14","v":"Test13"},null,{"$f":"'Audit questions'!A15","v":"Test14"},null,{"$f":"'Audit questions'!A16","v":"Test15"},null,{"$f":"'Audit questions'!A17","v":"Test16"},null,{"$f":"'Audit questions'!A18","v":"Test17"},null,{"$f":"'Audit questions'!A19","v":"Test18"},null,{"$f":"'Audit questions'!A20","v":"Test19"},null,{"$f":"'Audit questions'!A21","v":"Test20"},null,{"$f":"'Audit questions'!A22","v":"Test21"},null,{"$f":"'Audit questions'!A23","v":"Test22"},null,{"$f":"'Audit questions'!A24","v":"Test23"},null,{"$f":"'Audit questions'!A25","v":"Test24"},null,{"$f":"'Audit questions'!A26","v":"Test25"},null,{"$f":"'Audit questions'!A27","v":"Test26"},null,{"$f":"'Audit questions'!A28","v":"Test27"},null,{"$f":"'Audit questions'!A29","v":"Test28"},null,{"$f":"'Audit questions'!A30","v":"Test29"},null,{"$f":"'Audit questions'!A31","v":"Test30"},null,{"$f":"'Audit questions'!A32","v":"Test31"},null,{"$f":"'Audit questions'!A33","v":"Test32"},null,{"$f":"'Audit questions'!A34","v":"Test33"},null,{"$f":"'Audit questions'!A35","v":"Test34"},null,{"$f":"'Audit questions'!A36","v":"Test35"},null,{"$f":"'Audit questions'!A37","v":"Test36"},null,{"$f":"'Audit questions'!A38","v":"Test37"},null,{"$f":"'Audit questions'!A39","v":"Test38"},null,{"$f":"'Audit questions'!A40","v":"Test39"},null,{"$f":"'Audit questions'!A41","v":"Test40"}]
["Pt number","Date seen","Clinician 1","clinician 2","New/ F-up","Apt code",null,"Compliant?","Other result","Compliant?","Other result","Compliant?","Other result","Compliant?","Other result","Compliant?","Other result","Compliant?","Other result","Compliant?","Other result","Compliant?","Other result","Compliant?","Other result","Compliant?","Other result","Compliant?","Other result","Compliant?","Other result","Compliant?","Other result","Compliant?","Other result","Compliant?","Other result","Compliant?","Other result","Compliant?","Other result","Compliant?","Other result","Compliant?","Other result","Compliant?","Other result","Compliant?","Other result","Compliant?","Other result","Compliant?","Other result","Compliant?","Other result","Compliant?","Other result","Compliant?","Other result","Compliant?","Other result","Compliant?","Other result","Compliant?","Other result","Compliant?","Other result","Compliant?","Other result","Compliant?","Other result","Compliant?","Other result","Compliant?","Other result","Compliant?","Other result","Compliant?","Other result","Compliant?","Other result","Compliant?","Other result","Compliant?","Other result","Compliant?","Other result"]

{"sheet":"march-Data","index":41,"n_rows":12,"n_cols":41,"rows_kept":12,"cut":false,"hidden":true,"merged":[[0,0,1,0]]}
["Results",{"$f":"'Audit questions'!A2","v":"Test1"},{"$f":"'Audit questions'!A3","v":"Test2"},{"$f":"'Audit questions'!A4","v":"Test3"},{"$f":"'Audit questions'!A5","v":"Test4"},{"$f":"'Audit questions'!A6","v":"Test5"},{"$f":"'Audit questions'!A7","v":"Test6"},{"$f":"'Audit questions'!A8","v":"Test7"},{"$f":"'Audit questions'!A9","v":"Test8"},{"$f":"'Audit questions'!A10","v":"Test9"},{"$f":"'Audit questions'!A11","v":"Test10"},{"$f":"'Audit questions'!A12","v":"Test11"},{"$f":"'Audit questions'!A13","v":"Test12"},{"$f":"'Audit questions'!A14","v":"Test13"},{"$f":"'Audit questions'!A15","v":"Test14"},{"$f":"'Audit questions'!A16","v":"Test15"},{"$f":"'Audit questions'!A17","v":"Test16"},{"$f":"'Audit questions'!A18","v":"Test17"},{"$f":"'Audit questions'!A19","v":"Test18"},{"$f":"'Audit questions'!A20","v":"Test19"},{"$f":"'Audit questions'!A21","v":"Test20"},{"$f":"'Audit questions'!A22","v":"Test21"},{"$f":"'Audit questions'!A23","v":"Test22"},{"$f":"'Audit questions'!A24","v":"Test23"},{"$f":"'Audit questions'!A25","v":"Test24"},{"$f":"'Audit questions'!A26","v":"Test25"},{"$f":"'Audit questions'!A27","v":"Test26"},{"$f":"'Audit questions'!A28","v":"Test27"},{"$f":"'Audit questions'!A29","v":"Test28"},{"$f":"'Audit questions'!A30","v":"Test29"},{"$f":"'Audit questions'!A31","v":"Test30"},{"$f":"'Audit questions'!A32","v":"Test31"},{"$f":"'Audit questions'!A33","v":"Test32"},{"$f":"'Audit questions'!A34","v":"Test33"},{"$f":"'Audit questions'!A35","v":"Test34"},{"$f":"'Audit questions'!A36","v":"Test35"},{"$f":"'Audit questions'!A37","v":"Test36"},{"$f":"'Audit questions'!A38","v":"Test37"},{"$f":"'Audit questions'!A39","v":"Test38"},{"$f":"'Audit questions'!A40","v":"Test39"},{"$f":"'Audit questions'!A41","v":"Test40"}]
[null,"Compliant?","Compliant?","Compliant?","Compliant?","Compliant?","Compliant?","Compliant?","Compliant?","Compliant?","Compliant?","Compliant?","Compliant?","Compliant?","Compliant?","Compliant?","Compliant?","Compliant?","Compliant?","Compliant?","Compliant?","Compliant?","Compliant?","Compliant?","Compliant?","Compliant?","Compliant?","Compliant?","Compliant?","Compliant?","Compliant?","Compliant?","Compliant?","Compliant?","Compliant?","Compliant?","Compliant?","Compliant?","Compliant?","Compliant?","Compliant?"]
["Total Y",{"$f":"COUNTIF('march-Raw'!H:H,\"yes\")","v":0},{"$f":"COUNTIF('march-Raw'!J:J,\"yes\")","v":0},{"$f":"COUNTIF('march-Raw'!L:L,\"yes\")","v":0},{"$f":"COUNTIF('march-Raw'!N:N,\"yes\")","v":0},{"$f":"COUNTIF('march-Raw'!P:P,\"yes\")","v":0},{"$f":"COUNTIF('march-Raw'!R:R,\"yes\")","v":0},{"$f":"COUNTIF('march-Raw'!T:T,\"yes\")","v":0},{"$f":"COUNTIF('march-Raw'!V:V,\"yes\")","v":0},{"$f":"COUNTIF('march-Raw'!X:X,\"yes\")","v":0},{"$f":"COUNTIF('march-Raw'!Z:Z,\"yes\")","v":0},{"$f":"COUNTIF('march-Raw'!AB:AB,\"yes\")","v":0},{"$f":"COUNTIF('march-Raw'!AD:AD,\"yes\")","v":0},{"$f":"COUNTIF('march-Raw'!AF:AF,\"yes\")","v":0},{"$f":"COUNTIF('march-Raw'!AH:AH,\"yes\")","v":0},{"$f":"COUNTIF('march-Raw'!AJ:AJ,\"yes\")","v":0},{"$f":"COUNTIF('march-Raw'!AL:AL,\"yes\")","v":0},{"$f":"COUNTIF('march-Raw'!AN:AN,\"yes\")","v":0},{"$f":"COUNTIF('march-Raw'!AP:AP,\"yes\")","v":0},{"$f":"COUNTIF('march-Raw'!AR:AR,\"yes\")","v":0},{"$f":"COUNTIF('march-Raw'!AT:AT,\"yes\")","v":0},{"$f":"COUNTIF('march-Raw'!AV:AV,\"yes\")","v":0},{"$f":"COUNTIF('march-Raw'!AX:AX,\"yes\")","v":0},{"$f":"COUNTIF('march-Raw'!AZ:AZ,\"yes\")","v":0},{"$f":"COUNTIF('march-Raw'!BB:BB,\"yes\")","v":0},{"$f":"COUNTIF('march-Raw'!BD:BD,\"yes\")","v":0},{"$f":"COUNTIF('march-Raw'!BF:BF,\"yes\")","v":0},{"$f":"COUNTIF('march-Raw'!BH:BH,\"yes\")","v":0},{"$f":"COUNTIF('march-Raw'!BJ:BJ,\"yes\")","v":0},{"$f":"COUNTIF('march-Raw'!BL:BL,\"yes\")","v":0},{"$f":"COUNTIF('march-Raw'!BN:BN,\"yes\")","v":0},{"$f":"COUNTIF('march-Raw'!BP:BP,\"yes\")","v":0},{"$f":"COUNTIF('march-Raw'!BR:BR,\"yes\")","v":0},{"$f":"COUNTIF('march-Raw'!BT:BT,\"yes\")","v":0},{"$f":"COUNTIF('march-Raw'!BV:BV,\"yes\")","v":0},{"$f":"COUNTIF('march-Raw'!BX:BX,\"yes\")","v":0},{"$f":"COUNTIF('march-Raw'!BZ:BZ,\"yes\")","v":0},{"$f":"COUNTIF('march-Raw'!CB:CB,\"yes\")","v":0},{"$f":"COUNTIF('march-Raw'!CD:CD,\"yes\")","v":0},{"$f":"COUNTIF('march-Raw'!CF:CF,\"yes\")","v":0},{"$f":"COUNTIF('march-Raw'!CH:CH,\"yes\")","v":0}]
["Total N",{"$f":"COUNTIF('march-Raw'!H:H,\"no\")","v":0},{"$f":"COUNTIF('march-Raw'!J:J,\"no\")","v":0},{"$f":"COUNTIF('march-Raw'!L:L,\"no\")","v":0},{"$f":"COUNTIF('march-Raw'!N:N,\"no\")","v":0},{"$f":"COUNTIF('march-Raw'!P:P,\"no\")","v":0},{"$f":"COUNTIF('march-Raw'!R:R,\"no\")","v":0},{"$f":"COUNTIF('march-Raw'!T:T,\"no\")","v":0},{"$f":"COUNTIF('march-Raw'!V:V,\"no\")","v":0},{"$f":"COUNTIF('march-Raw'!X:X,\"no\")","v":0},{"$f":"COUNTIF('march-Raw'!Z:Z,\"no\")","v":0},{"$f":"COUNTIF('march-Raw'!AB:AB,\"no\")","v":0},{"$f":"COUNTIF('march-Raw'!AD:AD,\"no\")","v":0},{"$f":"COUNTIF('march-Raw'!AF:AF,\"no\")","v":0},{"$f":"COUNTIF('march-Raw'!AH:AH,\"no\")","v":0},{"$f":"COUNTIF('march-Raw'!AJ:AJ,\"no\")","v":0},{"$f":"COUNTIF('march-Raw'!AL:AL,\"no\")","v":0},{"$f":"COUNTIF('march-Raw'!AN:AN,\"no\")","v":0},{"$f":"COUNTIF('march-Raw'!AP:AP,\"no\")","v":0},{"$f":"COUNTIF('march-Raw'!AR:AR,\"no\")","v":0},{"$f":"COUNTIF('march-Raw'!AT:AT,\"no\")","v":0},{"$f":"COUNTIF('march-Raw'!AV:AV,\"no\")","v":0},{"$f":"COUNTIF('march-Raw'!AX:AX,\"no\")","v":0},{"$f":"COUNTIF('march-Raw'!AZ:AZ,\"no\")","v":0},{"$f":"COUNTIF('march-Raw'!BB:BB,\"no\")","v":0},{"$f":"COUNTIF('march-Raw'!BD:BD,\"no\")","v":0},{"$f":"COUNTIF('march-Raw'!BF:BF,\"no\")","v":0},{"$f":"COUNTIF('march-Raw'!BH:BH,\"no\")","v":0},{"$f":"COUNTIF('march-Raw'!BJ:BJ,\"no\")","v":0},{"$f":"COUNTIF('march-Raw'!BL:BL,\"no\")","v":0},{"$f":"COUNTIF('march-Raw'!BN:BN,\"no\")","v":0},{"$f":"COUNTIF('march-Raw'!BP:BP,\"no\")","v":0},{"$f":"COUNTIF('march-Raw'!BR:BR,\"no\")","v":0},{"$f":"COUNTIF('march-Raw'!BT:BT,\"no\")","v":0},{"$f":"COUNTIF('march-Raw'!BV:BV,\"no\")","v":0},{"$f":"COUNTIF('march-Raw'!BX:BX,\"no\")","v":0},{"$f":"COUNTIF('march-Raw'!BZ:BZ,\"no\")","v":0},{"$f":"COUNTIF('march-Raw'!CB:CB,\"no\")","v":0},{"$f":"COUNTIF('march-Raw'!CD:CD,\"no\")","v":0},{"$f":"COUNTIF('march-Raw'!CF:CF,\"no\")","v":0},{"$f":"COUNTIF('march-Raw'!CH:CH,\"no\")","v":0}]
["Total Justified",{"$f":"COUNTIF('march-Raw'!H:H,\"Justified\")","v":0},{"$f":"COUNTIF('march-Raw'!J:J,\"Justified\")","v":0},{"$f":"COUNTIF('march-Raw'!L:L,\"Justified\")","v":0},{"$f":"COUNTIF('march-Raw'!N:N,\"Justified\")","v":0},{"$f":"COUNTIF('march-Raw'!P:P,\"Justified\")","v":0},{"$f":"COUNTIF('march-Raw'!R:R,\"Justified\")","v":0},{"$f":"COUNTIF('march-Raw'!T:T,\"Justified\")","v":0},{"$f":"COUNTIF('march-Raw'!V:V,\"Justified\")","v":0},{"$f":"COUNTIF('march-Raw'!X:X,\"Justified\")","v":0},{"$f":"COUNTIF('march-Raw'!Z:Z,\"Justified\")","v":0},{"$f":"COUNTIF('march-Raw'!AB:AB,\"Justified\")","v":0},{"$f":"COUNTIF('march-Raw'!AD:AD,\"Justified\")","v":0},{"$f":"COUNTIF('march-Raw'!AF:AF,\"Justified\")","v":0},{"$f":"COUNTIF('march-Raw'!AH:AH,\"Justified\")","v":0},{"$f":"COUNTIF('march-Raw'!AJ:AJ,\"Justified\")","v":0},{"$f":"COUNTIF('march-Raw'!AL:AL,\"Justified\")","v":0},{"$f":"COUNTIF('march-Raw'!AN:AN,\"Justified\")","v":0},{"$f":"COUNTIF('march-Raw'!AP:AP,\"Justified\")","v":0},{"$f":"COUNTIF('march-Raw'!AR:AR,\"Justified\")","v":0},{"$f":"COUNTIF('march-Raw'!AT:AT,\"Justified\")","v":0},{"$f":"COUNTIF('march-Raw'!AV:AV,\"Justified\")","v":0},{"$f":"COUNTIF('march-Raw'!AX:AX,\"Justified\")","v":0},{"$f":"COUNTIF('march-Raw'!AZ:AZ,\"Justified\")","v":0},{"$f":"COUNTIF('march-Raw'!BB:BB,\"Justified\")","v":0},{"$f":"COUNTIF('march-Raw'!BD:BD,\"Justified\")","v":0},{"$f":"COUNTIF('march-Raw'!BF:BF,\"Justified\")","v":0},{"$f":"COUNTIF('march-Raw'!BH:BH,\"Justified\")","v":0},{"$f":"COUNTIF('march-Raw'!BJ:BJ,\"Justified\")","v":0},{"$f":"COUNTIF('march-Raw'!BL:BL,\"Justified\")","v":0},{"$f":"COUNTIF('march-Raw'!BN:BN,\"Justified\")","v":0},{"$f":"COUNTIF('march-Raw'!BP:BP,\"Justified\")","v":0},{"$f":"COUNTIF('march-Raw'!BR:BR,\"Justified\")","v":0},{"$f":"COUNTIF('march-Raw'!BT:BT,\"Justified\")","v":0},{"$f":"COUNTIF('march-Raw'!BV:BV,\"Justified\")","v":0},{"$f":"COUNTIF('march-Raw'!BX:BX,\"Justified\")","v":0},{"$f":"COUNTIF('march-Raw'!BZ:BZ,\"Justified\")","v":0},{"$f":"COUNTIF('march-Raw'!CB:CB,\"Justified\")","v":0},{"$f":"COUNTIF('march-Raw'!CD:CD,\"Justified\")","v":0},{"$f":"COUNTIF('march-Raw'!CF:CF,\"Justified\")","v":0},{"$f":"COUNTIF('march-Raw'!CH:CH,\"Justified\")","v":0}]
["Total NA",{"$f":"COUNTIF('march-Raw'!H:H,\"NA\")","v":0},{"$f":"COUNTIF('march-Raw'!J:J,\"NA\")","v":0},{"$f":"COUNTIF('march-Raw'!L:L,\"NA\")","v":0},{"$f":"COUNTIF('march-Raw'!N:N,\"NA\")","v":0},{"$f":"COUNTIF('march-Raw'!P:P,\"NA\")","v":0},{"$f":"COUNTIF('march-Raw'!R:R,\"NA\")","v":0},{"$f":"COUNTIF('march-Raw'!T:T,\"NA\")","v":0},{"$f":"COUNTIF('march-Raw'!V:V,\"NA\")","v":0},{"$f":"COUNTIF('march-Raw'!X:X,\"NA\")","v":0},{"$f":"COUNTIF('march-Raw'!Z:Z,\"NA\")","v":0},{"$f":"COUNTIF('march-Raw'!AB:AB,\"NA\")","v":0},{"$f":"COUNTIF('march-Raw'!AD:AD,\"NA\")","v":0},{"$f":"COUNTIF('march-Raw'!AF:AF,\"NA\")","v":0},{"$f":"COUNTIF('march-Raw'!AH:AH,\"NA\")","v":0},{"$f":"COUNTIF('march-Raw'!AJ:AJ,\"NA\")","v":0},{"$f":"COUNTIF('march-Raw'!AL:AL,\"NA\")","v":0},{"$f":"COUNTIF('march-Raw'!AN:AN,\"NA\")","v":0},{"$f":"COUNTIF('march-Raw'!AP:AP,\"NA\")","v":0},{"$f":"COUNTIF('march-Raw'!AR:AR,\"NA\")","v":0},{"$f":"COUNTIF('march-Raw'!AT:AT,\"NA\")","v":0},{"$f":"COUNTIF('march-Raw'!AV:AV,\"NA\")","v":0},{"$f":"COUNTIF('march-Raw'!AX:AX,\"NA\")","v":0},{"$f":"COUNTIF('march-Raw'!AZ:AZ,\"NA\")","v":0},{"$f":"COUNTIF('march-Raw'!BB:BB,\"NA\")","v":0},{"$f":"COUNTIF('march-Raw'!BD:BD,\"NA\")","v":0},{"$f":"COUNTIF('march-Raw'!BF:BF,\"NA\")","v":0},{"$f":"COUNTIF('march-Raw'!BH:BH,\"NA\")","v":0},{"$f":"COUNTIF('march-Raw'!BJ:BJ,\"NA\")","v":0},{"$f":"COUNTIF('march-Raw'!BL:BL,\"NA\")","v":0},{"$f":"COUNTIF('march-Raw'!BN:BN,\"NA\")","v":0},{"$f":"COUNTIF('march-Raw'!BP:BP,\"NA\")","v":0},{"$f":"COUNTIF('march-Raw'!BR:BR,\"NA\")","v":0},{"$f":"COUNTIF('march-Raw'!BT:BT,\"NA\")","v":0},{"$f":"COUNTIF('march-Raw'!BV:BV,\"NA\")","v":0},{"$f":"COUNTIF('march-Raw'!BX:BX,\"NA\")","v":0},{"$f":"COUNTIF('march-Raw'!BZ:BZ,\"NA\")","v":0},{"$f":"COUNTIF('march-Raw'!CB:CB,\"NA\")","v":0},{"$f":"COUNTIF('march-Raw'!CD:CD,\"NA\")","v":0},{"$f":"COUNTIF('march-Raw'!CF:CF,\"NA\")","v":0},{"$f":"COUNTIF('march-Raw'!CH:CH,\"NA\")","v":0}]
["Blanks",{"$f":"B8-(SUM(B3:B6))","v":0},{"$f":"C8-(SUM(C3:C6))","v":0},0,0,0,0,0,0,0,0,0,0,0,0,0,0,0,0,0,0,0,0,0,0,0,0,0,0,0,0,0,0,0,0,0,0,0,0,0,0]
["full sample size",{"$f":"COUNTA('march-Raw'!A:A)-2","v":0},{"$f":"B8","v":0},0,0,0,0,0,0,0,0,0,0,0,0,0,0,0,0,0,0,0,0,0,0,0,0,0,0,0,0,0,0,0,0,0,0,0,0,0,0]
["True sample size (-NA + blanks)",{"$f":"IF(ISERROR(B8-(B6+B7)),\"\",B8-(B6+B7))","v":0},{"$f":"IF(ISERROR(C8-(C6+C7)),\"\",C8-(C6+C7))","v":0},0,0,0,0,0,0,0,0,0,0,0,0,0,0,0,0,0,0,0,0,0,0,0,0,0,0,0,0,0,0,0,0,0,0,0,0,0,0]
["%Y",{"$f":"IF(ISERROR(B3/B9),\"\",B3/B9)","v":""},{"$f":"IF(ISERROR(C3/C9),\"\",C3/C9)","v":""},"","","","","","","","","","","","","","","","","","","","","","","","","","","","","","","","","","","","","",""]
["%N",{"$f":"IF(ISERROR(B4/B9),\"\",B4/B9)","v":""},{"$f":"IF(ISERROR(C4/C9),\"\",C4/C9)","v":""},"","","","","","","","","","","","","","","","","","","","","","","","","","","","","","","","","","","","","",""]
["%N - Justified",{"$f":"IF(ISERROR(B5/B9),\"\",B5/B9)","v":""},{"$f":"IF(ISERROR(C5/C9),\"\",C5/C9)","v":""},"","","","","","","","","","","","","","","","","","","","","","","","","","","","","","","","","","","","","",""]

{"sheet":"Export","index":42,"n_rows":58,"n_cols":8,"rows_kept":58,"cut":false,"hidden":true,"merged":[[1,1,1,4],[52,1,52,4],[54,2,54,4],[55,2,55,4],[57,2,57,4],[5,1,5,2],[5,3,5,4],[3,2,3,4],[51,1,51,4]]}
[]
[null,"Test audit"]
[]
[null,"Month:","May",null,null,null,"ignore me"]
[null,null,null,null,null,null,0.95,0.95]
[null,"Sample Size:",null,0,null,null,"80-95%","80-95%"]
[null,null,null,null,null,null,0.8,0.8]
[]
[]
[null,"Metric","Result","Prev result","Notes"]
[null,"Test1"]
[null,"Test2"]
[null,"Test3"]
[null,"Test4"]
[null,"Test5"]
[null,"Test6"]
[null,"Test7"]
[null,"Test8"]
[null,"Test9"]
[null,"Test10"]
[null,"Test11"]
[null,"Test12"]
[null,"Test13"]
[null,"Test14"]
[null,"Test15"]
[null,"Test16"]
[null,"Test17"]
[null,"Test18"]
[null,"Test19"]
[null,"Test20"]
[null,"Test21"]
[null,"Test22"]
[null,"Test23"]
[null,"Test24"]
[null,"Test25"]
[null,"Test26"]
[null,"Test27"]
[null,"Test28"]
[null,"Test29"]
[null,"Test30"]
[null,"Test31"]
[null,"Test32"]
[null,"Test33"]
[null,"Test34"]
[null,"Test35"]
[null,"Test36"]
[null,"Test37"]
[null,"Test38"]
[null,"Test39"]
[null,"Test40"]
[]
[null,"Action plan"]
[]
[]
[null,"Completed by:"]
[null,"Sponsor:"]
[]
[null,"QMA next due:"]

{"sheet":"Math","index":43,"n_rows":51,"n_cols":8,"rows_kept":51,"cut":false,"hidden":true,"merged":[]}
["Audit ID","Audit Name",null,null,null,"Selection list",null,"Month"]
["Audit 1",{"$f":"#REF!","v":{"$error":"#REF!"}},null,null,null,"Yes",null,"April"]
["Audit 2",{"$f":"#REF!","v":{"$error":"#REF!"}},null,null,null,"No",null,"May"]
["Audit 3",{"$f":"#REF!","v":{"$error":"#REF!"}},null,null,null,"Justified",null,"June"]
["Audit 4",{"$f":"#REF!","v":{"$error":"#REF!"}},null,null,null,"NA",null,"July"]
["Audit 5",{"$f":"#REF!","v":{"$error":"#REF!"}},null,null,null,null,null,"August"]
["Audit 6",{"$f":"#REF!","v":{"$error":"#REF!"}},null,null,null,null,null,"September"]
["Audit 7",{"$f":"#REF!","v":{"$error":"#REF!"}},null,null,null,null,null,"October"]
["Audit 8",{"$f":"#REF!","v":{"$error":"#REF!"}},null,null,null,null,null,"November"]
["Audit 9",{"$f":"#REF!","v":{"$error":"#REF!"}},null,null,null,null,null,"December"]
["Audit 10",{"$f":"#REF!","v":{"$error":"#REF!"}},null,null,null,null,null,"January"]
["Audit 11",{"$f":"#REF!","v":{"$error":"#REF!"}},null,null,null,null,null,"February"]
["Audit 12",{"$f":"#REF!","v":{"$error":"#REF!"}},null,null,null,null,null,"March"]
["Audit 13",{"$f":"#REF!","v":{"$error":"#REF!"}}]
["Audit 14",{"$f":"#REF!","v":{"$error":"#REF!"}}]
["Audit 15",{"$f":"#REF!","v":{"$error":"#REF!"}}]
["Audit 16",{"$f":"#REF!","v":{"$error":"#REF!"}}]
["Audit 17",{"$f":"#REF!","v":{"$error":"#REF!"}}]
["Audit 18",{"$f":"#REF!","v":{"$error":"#REF!"}}]
["Audit 19",{"$f":"#REF!","v":{"$error":"#REF!"}}]
["Audit 20",{"$f":"#REF!","v":{"$error":"#REF!"}}]
["Audit 21",{"$f":"#REF!","v":{"$error":"#REF!"}}]
["Audit 22",{"$f":"#REF!","v":{"$error":"#REF!"}}]
["Audit 23",{"$f":"#REF!","v":{"$error":"#REF!"}}]
["Audit 24",{"$f":"#REF!","v":{"$error":"#REF!"}}]
["Audit 25",{"$f":"#REF!","v":{"$error":"#REF!"}}]
["Audit 26",{"$f":"#REF!","v":{"$error":"#REF!"}}]
["Audit 27",{"$f":"#REF!","v":{"$error":"#REF!"}}]
["Audit 28",{"$f":"#REF!","v":{"$error":"#REF!"}}]
["Audit 29",{"$f":"#REF!","v":{"$error":"#REF!"}}]
["Audit 30",{"$f":"#REF!","v":{"$error":"#REF!"}}]
["Audit 31",{"$f":"#REF!","v":{"$error":"#REF!"}}]
["Audit 32",{"$f":"#REF!","v":{"$error":"#REF!"}}]
["Audit 33",{"$f":"#REF!","v":{"$error":"#REF!"}}]
["Audit 34",{"$f":"#REF!","v":{"$error":"#REF!"}}]
["Audit 35",{"$f":"#REF!","v":{"$error":"#REF!"}}]
["Audit 36",{"$f":"#REF!","v":{"$error":"#REF!"}}]
["Audit 37",{"$f":"#REF!","v":{"$error":"#REF!"}}]
["Audit 38",{"$f":"#REF!","v":{"$error":"#REF!"}}]
["Audit 39",{"$f":"#REF!","v":{"$error":"#REF!"}}]
["Audit 40",{"$f":"#REF!","v":{"$error":"#REF!"}}]
["Audit 41",{"$f":"#REF!","v":{"$error":"#REF!"}}]
["Audit 42",{"$f":"#REF!","v":{"$error":"#REF!"}}]
["Audit 43",{"$f":"#REF!","v":{"$error":"#REF!"}}]
["Audit 44",{"$f":"#REF!","v":{"$error":"#REF!"}}]
["Audit 45",{"$f":"#REF!","v":{"$error":"#REF!"}}]
["Audit 46",{"$f":"#REF!","v":{"$error":"#REF!"}}]
["Audit 47",{"$f":"#REF!","v":{"$error":"#REF!"}}]
["Audit 48",{"$f":"#REF!","v":{"$error":"#REF!"}}]
["Audit 49",{"$f":"#REF!","v":{"$error":"#REF!"}}]
["Audit 50",{"$f":"#REF!","v":{"$error":"#REF!"}}]